JHK 721H


JHK721H is registered to a Blue 1970, Morris Minor with a Petrol engine. It Failed its most recent MOT Test on the 27 November 2012

11 unique faults (11 Total) reported in its MOT History (3 Tests).

0 common/recurring faults.

67% (2) MOT Pass Rate and a 33% (1) MOT Failure Rate.

74,977 recorded miles.

JHK 721H


JHK721H is registered to a Blue 1970, Morris Minor with a Petrol engine. It Failed its most recent MOT Test on the 27 November 2012

11 unique faults (11 Total) reported in its MOT History (3 Tests).

0 common/recurring faults.

67% (2) MOT Pass Rate and a 33% (1) MOT Failure Rate.

74,977 recorded miles.

MOT PASS/Failure rate for JHK 721H

all MOT test results for JHK 721H represented as a percentage
MOT PASS/Failure rate for JHK 721H
all MOT test results for JHK 721H represented as a percentage

PERCENTAGE OF VEHICLE FAULTS WITH JHK 721H

ALL REPORTED FAULTS, DISPLAYED BY PERCENTAGE OF OCCURRENCE DURING ALL MOT TESTS
PERCENTAGE OF VEHICLE FAULTS WITH JHK 721H
ALL REPORTED FAULTS, DISPLAYED BY PERCENTAGE OF OCCURRENCE DURING ALL MOT TESTS
ADVISORY

FAIL

USER ENTERED

JHK 721H annual Faults by type

ALL REPORTED FAULTS, DISPLAYED over time and categorised by type
JHK 721H annual Faults by type
ALL REPORTED FAULTS, DISPLAYED over time and categorised by type

ALL JHK 721H ADVISORIES [2]

ALL ADVISORIES, ORDERED by OCCURRENCE DURING JHK 721H's MOT HISTORY
ALL JHK 721H ADVISORIES [2]
ALL ADVISORIES, ORDERED by OCCURRENCE DURING JHK 721H's MOT HISTORY
Advisory Faults | source www.vehiclestats.co.uk
Fault Fault Test Date Test Date/Time Reference MOT Test Reference
1 Front exhaust has a minor leak of exhaust gases (7.1.2) Front exhaust has a minor leak of exhaust gases (7.1.2) 11 September 2007 [14:48] 11/09/2007 994584857296 994584857296
1 Offside front front suspension has slight play in a lower suspension ball joint (2.5.b.1a) Offside front front suspension has slight play in a lower suspension ball joint (2.5.b.1a) 11 September 2007 [14:48] 11/09/2007 994584857296 994584857296

ALL JHK 721H Failure Faults [7]

ALL Failure faults, ORDERED by OCCURRENCE DURING JHK 721H's MOT HISTORY
ALL JHK 721H Failure Faults [7]
ALL Failure faults, ORDERED by OCCURRENCE DURING JHK 721H's MOT HISTORY
Fail Faults | source www.vehiclestats.co.uk
Fault Fault Test Date Test Date/Time Reference MOT Test Reference
1 Direction indicators not working (1.4.a.2c) Direction indicators not working (1.4.a.2c) 03 May 2005 [16:32] 03/05/2005 683073725139 683073725139
1 Nearside front vehicle structure has excessive corrosion, seriously affecting its strength within 30cm of the body mountings (6.1.b.2) Nearside front vehicle structure has excessive corrosion, seriously affecting its strength within 30cm of the body mountings (6.1.b.2) 03 May 2005 [16:32] 03/05/2005 683073725139 683073725139
1 Offside rear vehicle structure has excessive corrosion, seriously affecting its strength within 30cm of the body mountings (6.1.b.2) Offside rear vehicle structure has excessive corrosion, seriously affecting its strength within 30cm of the body mountings (6.1.b.2) 03 May 2005 [16:32] 03/05/2005 683073725139 683073725139
1 Rear vehicle structure has excessive corrosion, seriously affecting its strength within 30cm of the body mountings (6.1.b.2) Rear vehicle structure has excessive corrosion, seriously affecting its strength within 30cm of the body mountings (6.1.b.2) 03 May 2005 [16:32] 03/05/2005 683073725139 683073725139
1 Nearside front tyre has a tear, caused by separation or partial failure of its structure (4.1.d.1b) Nearside front tyre has a tear, caused by separation or partial failure of its structure (4.1.d.1b) 03 May 2005 [16:32] 03/05/2005 683073725139 683073725139
1 Steering system excessively tight (2.2.d.1) Steering system excessively tight (2.2.d.1) 03 May 2005 [16:32] 03/05/2005 683073725139 683073725139
1 Parking brake: efficiency below requirements (3.7.b.7) Parking brake: efficiency below requirements (3.7.b.7) 03 May 2005 [16:32] 03/05/2005 683073725139 683073725139

ALL JHK 721H User Entered Faults [2]

ALL User Entered faults, ORDERED by OCCURRENCE DURING JHK 721H's MOT HISTORY
ALL JHK 721H User Entered Faults [2]
ALL User Entered faults, ORDERED by OCCURRENCE DURING JHK 721H's MOT HISTORY
User Entered Faults | source www.vehiclestats.co.uk
Fault Fault Test Date Test Date/Time Reference MOT Test Reference
1 Chassis has been welded covered in underseal Chassis has been welded covered in underseal 27 November 2012 [11:52] 27/11/2012 417112032409 417112032409
1 Both rear brakes binding lightly Both rear brakes binding lightly 11 September 2007 [14:48] 11/09/2007 994584857296 994584857296

MOT TEST: 27 November 2012 11:52:36 PASSED
MOT TEST: 27 November 2012 11:52:36 PASSED

This test (417112032409) was completed on the 27 November 2012 11:52:36 and PASSED the requirements for a valid MOT with 1 comments.

This test (417112032409) was completed on the 27 November 2012 11:52:36 and PASSED the requirements for a valid MOT with 1 comments.

Recorded mileage: 74,977

Recorded mileage: 74,977


USER ENTERED


MOT TEST: 11 September 2007 14:48:27 PASSED
MOT TEST: 11 September 2007 14:48:27 PASSED

This test (994584857296) was completed on the 11 September 2007 14:48:27 and PASSED the requirements for a valid MOT with 3 comments.

This test (994584857296) was completed on the 11 September 2007 14:48:27 and PASSED the requirements for a valid MOT with 3 comments.

Recorded mileage: 74,555

Recorded mileage: 74,555


ADVISORY

USER ENTERED


MOT TEST: 03 May 2005 16:32:58 FAILED
MOT TEST: 03 May 2005 16:32:58 FAILED

This test (683073725139) was completed on the 03 May 2005 16:32:58 and FAILED the requirements for a valid MOT with 7 comments.

This test (683073725139) was completed on the 03 May 2005 16:32:58 and FAILED the requirements for a valid MOT with 7 comments.

Recorded mileage: 72,023

Recorded mileage: 72,023


FAIL