JHK 862H


JHK862H is registered to a White 1969, Morris Minor with a Petrol engine. It Failed its most recent MOT Test on the 31 July 2017

24 unique faults (25 Total) reported in its MOT History (12 Tests).

1 common/recurring faults.

67% (8) MOT Pass Rate and a 33% (4) MOT Failure Rate.

81,404 recorded miles.

JHK 862H


JHK862H is registered to a White 1969, Morris Minor with a Petrol engine. It Failed its most recent MOT Test on the 31 July 2017

24 unique faults (25 Total) reported in its MOT History (12 Tests).

1 common/recurring faults.

67% (8) MOT Pass Rate and a 33% (4) MOT Failure Rate.

81,404 recorded miles.

MOT PASS/Failure rate for JHK 862H

all MOT test results for JHK 862H represented as a percentage
MOT PASS/Failure rate for JHK 862H
all MOT test results for JHK 862H represented as a percentage

PERCENTAGE OF VEHICLE FAULTS WITH JHK 862H

ALL REPORTED FAULTS, DISPLAYED BY PERCENTAGE OF OCCURRENCE DURING ALL MOT TESTS
PERCENTAGE OF VEHICLE FAULTS WITH JHK 862H
ALL REPORTED FAULTS, DISPLAYED BY PERCENTAGE OF OCCURRENCE DURING ALL MOT TESTS
ADVISORY

FAIL

USER ENTERED

JHK 862H annual Faults by type

ALL REPORTED FAULTS, DISPLAYED over time and categorised by type
JHK 862H annual Faults by type
ALL REPORTED FAULTS, DISPLAYED over time and categorised by type

ALL JHK 862H ADVISORIES [2]

ALL ADVISORIES, ORDERED by OCCURRENCE DURING JHK 862H's MOT HISTORY
ALL JHK 862H ADVISORIES [2]
ALL ADVISORIES, ORDERED by OCCURRENCE DURING JHK 862H's MOT HISTORY
Fail Faults | source www.vehiclestats.co.uk
Fault Fault Test Date Test Date/Time Reference MOT Test Reference
1 Front brake hose slightly deteriorated both sides (3.6.b.4d) Front brake hose slightly deteriorated both sides (3.6.b.4d) 19 July 2017 [13:23] 19/07/2017 132159911424 132159911424
1 Advise inspection of rear brakes Advise inspection of rear brakes 19 July 2017 [13:23] 19/07/2017 132159911424 132159911424

ALL JHK 862H Failure Faults [21]

ALL Failure faults, ORDERED by OCCURRENCE DURING JHK 862H's MOT HISTORY
ALL JHK 862H Failure Faults [21]
ALL Failure faults, ORDERED by OCCURRENCE DURING JHK 862H's MOT HISTORY
Fail Faults | source www.vehiclestats.co.uk
Fault Fault Test Date Test Date/Time Reference MOT Test Reference
1 Front direction indicator incorrect colour both sides (1.4.a.2f) Front direction indicator incorrect colour both sides (1.4.a.2f) 19 July 2017 [13:23] 19/07/2017 132159911424 132159911424
1 Nearside rear tyre tread depth below requirements of 1.6mm (4.1.e.1) Nearside rear tyre tread depth below requirements of 1.6mm (4.1.e.1) 19 July 2017 [13:23] 19/07/2017 132159911424 132159911424
1 Brake pipe excessively corroded front to rear (3.6.b.2c) Brake pipe excessively corroded front to rear (3.6.b.2c) 19 July 2017 [13:23] 19/07/2017 132159911424 132159911424
1 Offside front brake pipe excessively corroded (3.6.b.2c) Offside front brake pipe excessively corroded (3.6.b.2c) 19 July 2017 [13:23] 19/07/2017 132159911424 132159911424
1 Offside front braking system leaking (3.6.a.1) Offside front braking system leaking (3.6.a.1) 19 July 2017 [13:23] 19/07/2017 132159911424 132159911424
1 Nearside rear suspension spring mounting prescribed area is excessively corroded by spring hanger (2.4.a.3) Nearside rear suspension spring mounting prescribed area is excessively corroded by spring hanger (2.4.a.3) 19 July 2017 [13:23] 19/07/2017 132159911424 132159911424
1 Offside front suspension spring mounting prescribed area is excessively corroded by tie bar and existing repairs blown apart (2.4.a.3) Offside front suspension spring mounting prescribed area is excessively corroded by tie bar and existing repairs blown apart (2.4.a.3) 19 July 2017 [13:23] 19/07/2017 132159911424 132159911424
1 Nearside front tie bar/rod attachment bracket/mounting insecure fixing to suspension arm (2.4.g.1) Nearside front tie bar/rod attachment bracket/mounting insecure fixing to suspension arm (2.4.g.1) 19 July 2017 [13:23] 19/07/2017 132159911424 132159911424
1 Service brake: efficiency below requirements (3.7.b.7) Service brake: efficiency below requirements (3.7.b.7) 19 July 2017 [13:23] 19/07/2017 132159911424 132159911424
1 Front brakes imbalanced across an axle (3.7.b.5b) Front brakes imbalanced across an axle (3.7.b.5b) 19 July 2017 [13:23] 19/07/2017 132159911424 132159911424
1 Stop lamp not working both sides (1.2.1b) Stop lamp not working both sides (1.2.1b) 18 July 2016 [12:48] 18/07/2016 247199180234 247199180234
1 Offside outer suspension component mounting prescribed area is excessively corroded centre structure/floor by torsion bar fixing (2.4.a.3) Offside outer suspension component mounting prescribed area is excessively corroded centre structure/floor by torsion bar fixing (2.4.a.3) 18 July 2016 [12:48] 18/07/2016 247199180234 247199180234
1 Offside front suspension component mounting prescribed area is inadequately repaired chassis by tie bar (2.4.a.3) Offside front suspension component mounting prescribed area is inadequately repaired chassis by tie bar (2.4.a.3) 18 July 2016 [12:48] 18/07/2016 247199180234 247199180234
1 Offside headlamp not working on main beam (1.7.5a) Offside headlamp not working on main beam (1.7.5a) 13 July 2015 [13:39] 13/07/2015 437244295123 437244295123
1 Offside front suspension component mounting prescribed area is excessively corroded (2.4.a.3) Offside front suspension component mounting prescribed area is excessively corroded (2.4.a.3) 13 July 2015 [13:39] 13/07/2015 437244295123 437244295123
1 Inner front lower suspension arm rubber bush deteriorated resulting in excessive movement (2.4.g.2) Inner front lower suspension arm rubber bush deteriorated resulting in excessive movement (2.4.g.2) 13 July 2015 [13:39] 13/07/2015 437244295123 437244295123
1 Nearside outer front upper suspension arm rubber bush deteriorated resulting in excessive movement (2.4.g.2) Nearside outer front upper suspension arm rubber bush deteriorated resulting in excessive movement (2.4.g.2) 13 July 2015 [13:39] 13/07/2015 437244295123 437244295123
1 Nearside front tyre has a bulge, caused by separation or partial failure of its structure (4.1.d.1b) Nearside front tyre has a bulge, caused by separation or partial failure of its structure (4.1.d.1b) 13 July 2015 [13:39] 13/07/2015 437244295123 437244295123
1 Nearside front body has a sharp edge caused by corrosion (6.1.c.1) Nearside front body has a sharp edge caused by corrosion (6.1.c.1) 29 May 2014 [14:33] 29/05/2014 246549644475 246549644475
1 Offside front body has a sharp edge caused by corrosion (6.1.c.1) Offside front body has a sharp edge caused by corrosion (6.1.c.1) 29 May 2014 [14:33] 29/05/2014 246549644475 246549644475
1 Offside rear suspension spring mounting prescribed area is excessively corroded (2.4.a.3) Offside rear suspension spring mounting prescribed area is excessively corroded (2.4.a.3) 29 May 2014 [14:33] 29/05/2014 246549644475 246549644475

ALL JHK 862H User Entered Faults [2]

ALL User Entered faults, ORDERED by OCCURRENCE DURING JHK 862H's MOT HISTORY
ALL JHK 862H User Entered Faults [2]
ALL User Entered faults, ORDERED by OCCURRENCE DURING JHK 862H's MOT HISTORY
User Entered Faults | source www.vehiclestats.co.uk
Fault Fault Test Date Test Date/Time Reference MOT Test Reference
2 Nearside front top suspension bush breaking up Nearside front top suspension bush breaking up 02 June 2014 [12:49] 02/06/2014 29 May 2014 [14:33] 29/05/2014 986453054118 986453054118 246549644475 246549644475

MOT TEST: 31 July 2017 14:21:30 PASSED
MOT TEST: 31 July 2017 14:21:30 PASSED

This test (571257097810) was completed on the 31 July 2017 14:21:30 and PASSED the requirements for a valid MOT with 0 comments.

This test (571257097810) was completed on the 31 July 2017 14:21:30 and PASSED the requirements for a valid MOT with 0 comments.

Recorded mileage: 81,404

Recorded mileage: 81,404


MOT TEST: 19 July 2017 13:23:43 FAILED
MOT TEST: 19 July 2017 13:23:43 FAILED

This test (132159911424) was completed on the 19 July 2017 13:23:43 and FAILED the requirements for a valid MOT with 12 comments.

This test (132159911424) was completed on the 19 July 2017 13:23:43 and FAILED the requirements for a valid MOT with 12 comments.

Recorded mileage: 81,404

Recorded mileage: 81,404


ADVISORY

FAIL


MOT TEST: 02 August 2016 08:09:10 PASSED
MOT TEST: 02 August 2016 08:09:10 PASSED

This test (174862443898) was completed on the 02 August 2016 08:09:10 and PASSED the requirements for a valid MOT with 0 comments.

This test (174862443898) was completed on the 02 August 2016 08:09:10 and PASSED the requirements for a valid MOT with 0 comments.

Recorded mileage: 81,404

Recorded mileage: 81,404


MOT TEST: 18 July 2016 12:48:01 FAILED
MOT TEST: 18 July 2016 12:48:01 FAILED

This test (247199180234) was completed on the 18 July 2016 12:48:01 and FAILED the requirements for a valid MOT with 3 comments.

This test (247199180234) was completed on the 18 July 2016 12:48:01 and FAILED the requirements for a valid MOT with 3 comments.

Recorded mileage: 81,404

Recorded mileage: 81,404


FAIL


MOT TEST: 27 July 2015 12:06:19 PASSED
MOT TEST: 27 July 2015 12:06:19 PASSED

This test (379148005427) was completed on the 27 July 2015 12:06:19 and PASSED the requirements for a valid MOT with 0 comments.

This test (379148005427) was completed on the 27 July 2015 12:06:19 and PASSED the requirements for a valid MOT with 0 comments.

Recorded mileage: 81,404

Recorded mileage: 81,404


MOT TEST: 13 July 2015 13:39:51 FAILED
MOT TEST: 13 July 2015 13:39:51 FAILED

This test (437244295123) was completed on the 13 July 2015 13:39:51 and FAILED the requirements for a valid MOT with 5 comments.

This test (437244295123) was completed on the 13 July 2015 13:39:51 and FAILED the requirements for a valid MOT with 5 comments.

Recorded mileage: 81,404

Recorded mileage: 81,404


FAIL


MOT TEST: 02 June 2014 12:49:53 PASSED
MOT TEST: 02 June 2014 12:49:53 PASSED

This test (986453054118) was completed on the 02 June 2014 12:49:53 and PASSED the requirements for a valid MOT with 1 comments.

This test (986453054118) was completed on the 02 June 2014 12:49:53 and PASSED the requirements for a valid MOT with 1 comments.

Recorded mileage: 81,404

Recorded mileage: 81,404


USER ENTERED


MOT TEST: 29 May 2014 14:33:32 FAILED
MOT TEST: 29 May 2014 14:33:32 FAILED

This test (246549644475) was completed on the 29 May 2014 14:33:32 and FAILED the requirements for a valid MOT with 4 comments.

This test (246549644475) was completed on the 29 May 2014 14:33:32 and FAILED the requirements for a valid MOT with 4 comments.

Recorded mileage: 81,404

Recorded mileage: 81,404


FAIL

USER ENTERED


MOT TEST: 30 May 2013 15:46:10 PASSED
MOT TEST: 30 May 2013 15:46:10 PASSED

This test (217310953177) was completed on the 30 May 2013 15:46:10 and PASSED the requirements for a valid MOT with 0 comments.

This test (217310953177) was completed on the 30 May 2013 15:46:10 and PASSED the requirements for a valid MOT with 0 comments.

Recorded mileage: 81,404

Recorded mileage: 81,404


MOT TEST: 24 April 2012 14:18:09 PASSED
MOT TEST: 24 April 2012 14:18:09 PASSED

This test (977005412177) was completed on the 24 April 2012 14:18:09 and PASSED the requirements for a valid MOT with 0 comments.

This test (977005412177) was completed on the 24 April 2012 14:18:09 and PASSED the requirements for a valid MOT with 0 comments.

Recorded mileage: 81,123

Recorded mileage: 81,123


MOT TEST: 18 April 2011 15:49:02 PASSED
MOT TEST: 18 April 2011 15:49:02 PASSED

This test (778398001186) was completed on the 18 April 2011 15:49:02 and PASSED the requirements for a valid MOT with 0 comments.

This test (778398001186) was completed on the 18 April 2011 15:49:02 and PASSED the requirements for a valid MOT with 0 comments.

Recorded mileage: 79,095

Recorded mileage: 79,095


MOT TEST: 13 April 2010 18:05:16 PASSED
MOT TEST: 13 April 2010 18:05:16 PASSED

This test (824013800134) was completed on the 13 April 2010 18:05:16 and PASSED the requirements for a valid MOT with 0 comments.

This test (824013800134) was completed on the 13 April 2010 18:05:16 and PASSED the requirements for a valid MOT with 0 comments.

Recorded mileage: 77,116

Recorded mileage: 77,116