JHR 304E


JHR304E is registered to a Blue 1967, Morris Minor 1000 with a Petrol engine. It Failed its most recent MOT Test on the 03 November 2016

23 unique faults (24 Total) reported in its MOT History (15 Tests).

1 common/recurring faults.

73% (11) MOT Pass Rate and a 27% (4) MOT Failure Rate.

46,940 recorded miles.

JHR 304E


JHR304E is registered to a Blue 1967, Morris Minor 1000 with a Petrol engine. It Failed its most recent MOT Test on the 03 November 2016

23 unique faults (24 Total) reported in its MOT History (15 Tests).

1 common/recurring faults.

73% (11) MOT Pass Rate and a 27% (4) MOT Failure Rate.

46,940 recorded miles.

MOT PASS/Failure rate for JHR 304E

all MOT test results for JHR 304E represented as a percentage
MOT PASS/Failure rate for JHR 304E
all MOT test results for JHR 304E represented as a percentage

PERCENTAGE OF VEHICLE FAULTS WITH JHR 304E

ALL REPORTED FAULTS, DISPLAYED BY PERCENTAGE OF OCCURRENCE DURING ALL MOT TESTS
PERCENTAGE OF VEHICLE FAULTS WITH JHR 304E
ALL REPORTED FAULTS, DISPLAYED BY PERCENTAGE OF OCCURRENCE DURING ALL MOT TESTS
ADVISORY

FAIL

USER ENTERED

PASS WITH RECTIFICATION

JHR 304E annual Faults by type

ALL REPORTED FAULTS, DISPLAYED over time and categorised by type
JHR 304E annual Faults by type
ALL REPORTED FAULTS, DISPLAYED over time and categorised by type

ALL JHR 304E ADVISORIES [5]

ALL ADVISORIES, ORDERED by OCCURRENCE DURING JHR 304E's MOT HISTORY
ALL JHR 304E ADVISORIES [5]
ALL ADVISORIES, ORDERED by OCCURRENCE DURING JHR 304E's MOT HISTORY
Advisory Faults | source www.vehiclestats.co.uk
Fault Fault Test Date Test Date/Time Reference MOT Test Reference
2 Nearside front brake pipe slightly corroded (3.6.b.2c) Nearside front brake pipe slightly corroded (3.6.b.2c) 16 September 2010 [16:37] 16/09/2010 15 September 2010 [15:17] 15/09/2010 161199150218 161199150218 280538750279 280538750279
1 Offside front upper suspension arm has slight play in a pin/bush (2.4.g.2) Offside front upper suspension arm has slight play in a pin/bush (2.4.g.2) 30 October 2013 [15:32] 30/10/2013 417373103333 417373103333
1 Nearside front tyre worn close to the legal limit (4.1.e.1) Nearside front tyre worn close to the legal limit (4.1.e.1) 03 September 2009 [10:31] 03/09/2009 110856749201 110856749201
1 Offside front tyre worn close to the legal limit (4.1.e.1) Offside front tyre worn close to the legal limit (4.1.e.1) 03 September 2009 [10:31] 03/09/2009 110856749201 110856749201

ALL JHR 304E Failure Faults [17]

ALL Failure faults, ORDERED by OCCURRENCE DURING JHR 304E's MOT HISTORY
ALL JHR 304E Failure Faults [17]
ALL Failure faults, ORDERED by OCCURRENCE DURING JHR 304E's MOT HISTORY
Fail Faults | source www.vehiclestats.co.uk
Fault Fault Test Date Test Date/Time Reference MOT Test Reference
1 Nearside headlamp aim too low (1.8) Nearside headlamp aim too low (1.8) 01 October 2014 [09:44] 01/10/2014 419174874223 419174874223
1 Front exhaust has a major leak of exhaust gases (7.1.2) Front exhaust has a major leak of exhaust gases (7.1.2) 01 October 2014 [09:44] 01/10/2014 419174874223 419174874223
1 Nearside windscreen washer provides insufficient washer liquid (8.2.3) Nearside windscreen washer provides insufficient washer liquid (8.2.3) 15 September 2010 [15:17] 15/09/2010 280538750279 280538750279
1 Nearside windscreen wiper does not clear the windscreen effectively (8.2.2) Nearside windscreen wiper does not clear the windscreen effectively (8.2.2) 15 September 2010 [15:17] 15/09/2010 280538750279 280538750279
1 Offside windscreen wiper does not clear the windscreen effectively (8.2.2) Offside windscreen wiper does not clear the windscreen effectively (8.2.2) 15 September 2010 [15:17] 15/09/2010 280538750279 280538750279
1 Offside headlamp excessively deteriorated so that the light output is severely reduced (1.7.5a) Offside headlamp excessively deteriorated so that the light output is severely reduced (1.7.5a) 15 September 2010 [15:17] 15/09/2010 280538750279 280538750279
1 Registration plate lamp not working (1.1.c.1d) Registration plate lamp not working (1.1.c.1d) 15 September 2010 [15:17] 15/09/2010 280538750279 280538750279
1 Nearside steering rack gaiter insecure (2.2.d.2d) Nearside steering rack gaiter insecure (2.2.d.2d) 15 September 2010 [15:17] 15/09/2010 280538750279 280538750279
1 Nearside rear suspension spring mounting prescribed area is excessively corroded (2.4.a.3) Nearside rear suspension spring mounting prescribed area is excessively corroded (2.4.a.3) 15 September 2010 [15:17] 15/09/2010 280538750279 280538750279
1 Offside rear suspension spring mounting prescribed area is excessively corroded (2.4.a.3) Offside rear suspension spring mounting prescribed area is excessively corroded (2.4.a.3) 15 September 2010 [15:17] 15/09/2010 280538750279 280538750279
1 Nearside rear brake recording little or no effort (3.7.b.5a) Nearside rear brake recording little or no effort (3.7.b.5a) 15 September 2010 [15:17] 15/09/2010 280538750279 280538750279
1 Nearside rear parking brake recording little or no effort (3.7.b.6a) Nearside rear parking brake recording little or no effort (3.7.b.6a) 15 September 2010 [15:17] 15/09/2010 280538750279 280538750279
1 Rear brake application uneven (3.7.b.2) Rear brake application uneven (3.7.b.2) 15 September 2010 [15:17] 15/09/2010 280538750279 280538750279
1 Parking brake: efficiency below requirements (3.7.b.7) Parking brake: efficiency below requirements (3.7.b.7) 15 September 2010 [15:17] 15/09/2010 280538750279 280538750279
1 Nearside front brake binding (3.7.b.1) Nearside front brake binding (3.7.b.1) 28 July 2008 [13:01] 28/07/2008 350270118287 350270118287
1 Front brake application uneven (3.7.b.2) Front brake application uneven (3.7.b.2) 28 July 2008 [13:01] 28/07/2008 350270118287 350270118287
1 Brakes imbalanced across an axle (3.7.b.5b) Brakes imbalanced across an axle (3.7.b.5b) 28 July 2008 [13:01] 28/07/2008 350270118287 350270118287

ALL JHR 304E User Entered Faults [1]

ALL User Entered faults, ORDERED by OCCURRENCE DURING JHR 304E's MOT HISTORY
ALL JHR 304E User Entered Faults [1]
ALL User Entered faults, ORDERED by OCCURRENCE DURING JHR 304E's MOT HISTORY
Fail Faults | source www.vehiclestats.co.uk
Fault Fault Test Date Test Date/Time Reference MOT Test Reference
1 Nearside rear brake back plate oil soaked Nearside rear brake back plate oil soaked 15 September 2010 [15:17] 15/09/2010 280538750279 280538750279

ALL JHR 304E Pass With Rectification Faults [1]

ALL Pass With Rectification faults, ORDERED by OCCURRENCE DURING JHR 304E's MOT HISTORY
ALL JHR 304E Pass With Rectification Faults [1]
ALL Pass With Rectification faults, ORDERED by OCCURRENCE DURING JHR 304E's MOT HISTORY
Pass With Rectification Faults | source www.vehiclestats.co.uk
Fault Fault Test Date Test Date/Time Reference MOT Test Reference
1 Offside windscreen washer provides insufficient washer liquid (8.2.3) Offside windscreen washer provides insufficient washer liquid (8.2.3) 03 December 2015 [08:55] 03/12/2015 900679092972 900679092972

MOT TEST: 03 November 2016 09:38:50 PASSED
MOT TEST: 03 November 2016 09:38:50 PASSED

This test (195277864223) was completed on the 03 November 2016 09:38:50 and PASSED the requirements for a valid MOT with 0 comments.

This test (195277864223) was completed on the 03 November 2016 09:38:50 and PASSED the requirements for a valid MOT with 0 comments.

Recorded mileage: 46,940

Recorded mileage: 46,940


MOT TEST: 03 December 2015 08:55:38 PASSED
MOT TEST: 03 December 2015 08:55:38 PASSED

This test (366382716787) was completed on the 03 December 2015 08:55:38 and PASSED the requirements for a valid MOT with 0 comments.

This test (366382716787) was completed on the 03 December 2015 08:55:38 and PASSED the requirements for a valid MOT with 0 comments.

Recorded mileage: 46,895

Recorded mileage: 46,895


MOT TEST: 03 December 2015 08:55:37 FAILED
MOT TEST: 03 December 2015 08:55:37 FAILED

This test (900679092972) was completed on the 03 December 2015 08:55:37 and FAILED the requirements for a valid MOT with 1 comments.

This test (900679092972) was completed on the 03 December 2015 08:55:37 and FAILED the requirements for a valid MOT with 1 comments.

Recorded mileage: 46,895

Recorded mileage: 46,895


PASS WITH RECTIFICATION


MOT TEST: 01 October 2014 14:17:45 PASSED
MOT TEST: 01 October 2014 14:17:45 PASSED

This test (747084374251) was completed on the 01 October 2014 14:17:45 and PASSED the requirements for a valid MOT with 0 comments.

This test (747084374251) was completed on the 01 October 2014 14:17:45 and PASSED the requirements for a valid MOT with 0 comments.

Recorded mileage: 46,845

Recorded mileage: 46,845


MOT TEST: 01 October 2014 09:44:18 FAILED
MOT TEST: 01 October 2014 09:44:18 FAILED

This test (419174874223) was completed on the 01 October 2014 09:44:18 and FAILED the requirements for a valid MOT with 2 comments.

This test (419174874223) was completed on the 01 October 2014 09:44:18 and FAILED the requirements for a valid MOT with 2 comments.

Recorded mileage: 46,844

Recorded mileage: 46,844


FAIL


MOT TEST: 30 October 2013 15:32:29 PASSED
MOT TEST: 30 October 2013 15:32:29 PASSED

This test (417373103333) was completed on the 30 October 2013 15:32:29 and PASSED the requirements for a valid MOT with 1 comments.

This test (417373103333) was completed on the 30 October 2013 15:32:29 and PASSED the requirements for a valid MOT with 1 comments.

Recorded mileage: 46,792

Recorded mileage: 46,792


ADVISORY


MOT TEST: 31 October 2012 12:56:02 PASSED
MOT TEST: 31 October 2012 12:56:02 PASSED

This test (918895002363) was completed on the 31 October 2012 12:56:02 and PASSED the requirements for a valid MOT with 0 comments.

This test (918895002363) was completed on the 31 October 2012 12:56:02 and PASSED the requirements for a valid MOT with 0 comments.

Recorded mileage: 46,422

Recorded mileage: 46,422


MOT TEST: 12 October 2011 11:05:11 PASSED
MOT TEST: 12 October 2011 11:05:11 PASSED

This test (709415381246) was completed on the 12 October 2011 11:05:11 and PASSED the requirements for a valid MOT with 0 comments.

This test (709415381246) was completed on the 12 October 2011 11:05:11 and PASSED the requirements for a valid MOT with 0 comments.

Recorded mileage: 45,549

Recorded mileage: 45,549


MOT TEST: 16 September 2010 16:37:30 PASSED
MOT TEST: 16 September 2010 16:37:30 PASSED

This test (161199150218) was completed on the 16 September 2010 16:37:30 and PASSED the requirements for a valid MOT with 1 comments.

This test (161199150218) was completed on the 16 September 2010 16:37:30 and PASSED the requirements for a valid MOT with 1 comments.

Recorded mileage: 44,843

Recorded mileage: 44,843


ADVISORY


MOT TEST: 15 September 2010 15:17:48 FAILED
MOT TEST: 15 September 2010 15:17:48 FAILED

This test (280538750279) was completed on the 15 September 2010 15:17:48 and FAILED the requirements for a valid MOT with 14 comments.

This test (280538750279) was completed on the 15 September 2010 15:17:48 and FAILED the requirements for a valid MOT with 14 comments.

Recorded mileage: 44,839

Recorded mileage: 44,839


ADVISORY

FAIL

USER ENTERED


MOT TEST: 03 September 2009 10:31:06 PASSED
MOT TEST: 03 September 2009 10:31:06 PASSED

This test (110856749201) was completed on the 03 September 2009 10:31:06 and PASSED the requirements for a valid MOT with 2 comments.

This test (110856749201) was completed on the 03 September 2009 10:31:06 and PASSED the requirements for a valid MOT with 2 comments.

Recorded mileage: 43,533

Recorded mileage: 43,533


ADVISORY


MOT TEST: 29 July 2008 14:16:56 PASSED
MOT TEST: 29 July 2008 14:16:56 PASSED

This test (542801818278) was completed on the 29 July 2008 14:16:56 and PASSED the requirements for a valid MOT with 0 comments.

This test (542801818278) was completed on the 29 July 2008 14:16:56 and PASSED the requirements for a valid MOT with 0 comments.

Recorded mileage: 42,550

Recorded mileage: 42,550


MOT TEST: 28 July 2008 13:01:31 FAILED
MOT TEST: 28 July 2008 13:01:31 FAILED

This test (350270118287) was completed on the 28 July 2008 13:01:31 and FAILED the requirements for a valid MOT with 3 comments.

This test (350270118287) was completed on the 28 July 2008 13:01:31 and FAILED the requirements for a valid MOT with 3 comments.

Recorded mileage: 42,548

Recorded mileage: 42,548


FAIL


MOT TEST: 14 August 2007 10:09:11 PASSED
MOT TEST: 14 August 2007 10:09:11 PASSED

This test (624456727223) was completed on the 14 August 2007 10:09:11 and PASSED the requirements for a valid MOT with 0 comments.

This test (624456727223) was completed on the 14 August 2007 10:09:11 and PASSED the requirements for a valid MOT with 0 comments.

Recorded mileage: 41,242

Recorded mileage: 41,242


MOT TEST: 08 August 2006 13:03:33 PASSED
MOT TEST: 08 August 2006 13:03:33 PASSED

This test (552860026273) was completed on the 08 August 2006 13:03:33 and PASSED the requirements for a valid MOT with 0 comments.

This test (552860026273) was completed on the 08 August 2006 13:03:33 and PASSED the requirements for a valid MOT with 0 comments.

Recorded mileage: 40,607

Recorded mileage: 40,607