JHY 182P


JHY182P is registered to a Blue 1975, Morris Mini clubman with a Petrol engine. It Failed its most recent MOT Test on the 10 April 2017

28 unique faults (29 Total) reported in its MOT History (5 Tests).

1 common/recurring faults.

60% (3) MOT Pass Rate and a 40% (2) MOT Failure Rate.

36,741 recorded miles.

JHY 182P


JHY182P is registered to a Blue 1975, Morris Mini clubman with a Petrol engine. It Failed its most recent MOT Test on the 10 April 2017

28 unique faults (29 Total) reported in its MOT History (5 Tests).

1 common/recurring faults.

60% (3) MOT Pass Rate and a 40% (2) MOT Failure Rate.

36,741 recorded miles.

MOT PASS/Failure rate for JHY 182P

all MOT test results for JHY 182P represented as a percentage
MOT PASS/Failure rate for JHY 182P
all MOT test results for JHY 182P represented as a percentage

PERCENTAGE OF VEHICLE FAULTS WITH JHY 182P

ALL REPORTED FAULTS, DISPLAYED BY PERCENTAGE OF OCCURRENCE DURING ALL MOT TESTS
PERCENTAGE OF VEHICLE FAULTS WITH JHY 182P
ALL REPORTED FAULTS, DISPLAYED BY PERCENTAGE OF OCCURRENCE DURING ALL MOT TESTS
ADVISORY

FAIL

USER ENTERED

JHY 182P annual Faults by type

ALL REPORTED FAULTS, DISPLAYED over time and categorised by type
JHY 182P annual Faults by type
ALL REPORTED FAULTS, DISPLAYED over time and categorised by type

ALL JHY 182P ADVISORIES [5]

ALL ADVISORIES, ORDERED by OCCURRENCE DURING JHY 182P's MOT HISTORY
ALL JHY 182P ADVISORIES [5]
ALL ADVISORIES, ORDERED by OCCURRENCE DURING JHY 182P's MOT HISTORY
Advisory Faults | source www.vehiclestats.co.uk
Fault Fault Test Date Test Date/Time Reference MOT Test Reference
1 Rear passenger seat(s) missing at time of test () Rear passenger seat(s) missing at time of test () 10 April 2017 [12:35] 10/04/2017 755089548784 755089548784
1 Offside front upper front suspension ball joint dust cover damaged, but preventing the ingress of dirt (2.4.g.2) Offside front upper front suspension ball joint dust cover damaged, but preventing the ingress of dirt (2.4.g.2) 10 April 2017 [12:35] 10/04/2017 755089548784 755089548784
1 Offside front lower front suspension ball joint dust cover damaged, but preventing the ingress of dirt (2.4.g.2) Offside front lower front suspension ball joint dust cover damaged, but preventing the ingress of dirt (2.4.g.2) 10 April 2017 [12:35] 10/04/2017 755089548784 755089548784
1 Nearside front suspension has slight play in a upper suspension ball joint (2.5.b.1a) Nearside front suspension has slight play in a upper suspension ball joint (2.5.b.1a) 10 April 2017 [12:35] 10/04/2017 755089548784 755089548784
1 Offside front suspension has slight play in a upper suspension ball joint (2.5.b.1a) Offside front suspension has slight play in a upper suspension ball joint (2.5.b.1a) 10 April 2017 [12:35] 10/04/2017 755089548784 755089548784

ALL JHY 182P Failure Faults [20]

ALL Failure faults, ORDERED by OCCURRENCE DURING JHY 182P's MOT HISTORY
ALL JHY 182P Failure Faults [20]
ALL Failure faults, ORDERED by OCCURRENCE DURING JHY 182P's MOT HISTORY
Fail Faults | source www.vehiclestats.co.uk
Fault Fault Test Date Test Date/Time Reference MOT Test Reference
2 Brake pedal spongy (3.3.b.1b) Brake pedal spongy (3.3.b.1b) 05 March 2014 [11:30] 05/03/2014 16 May 2011 [12:52] 16/05/2011 878504964083 878504964083 418166131159 418166131159
1 Brake pedal has insufficient reserve movement (3.3.a.5) Brake pedal has insufficient reserve movement (3.3.a.5) 05 March 2014 [11:30] 05/03/2014 878504964083 878504964083
1 Nearside front wheel bearing rough when rotated (2.5.a.2) Nearside front wheel bearing rough when rotated (2.5.a.2) 05 March 2014 [11:30] 05/03/2014 878504964083 878504964083
1 Electrical wiring insecure (1.9.2a) Electrical wiring insecure (1.9.2a) 05 March 2014 [11:30] 05/03/2014 878504964083 878504964083
1 Nearside front headlamp not working on main beam (1.7.5a) Nearside front headlamp not working on main beam (1.7.5a) 16 May 2011 [12:52] 16/05/2011 418166131159 418166131159
1 Offside front headlamp not working on main beam (1.7.5a) Offside front headlamp not working on main beam (1.7.5a) 16 May 2011 [12:52] 16/05/2011 418166131159 418166131159
1 Nearside front headlamp aim too low (1.8) Nearside front headlamp aim too low (1.8) 16 May 2011 [12:52] 16/05/2011 418166131159 418166131159
1 Offside front headlamp aim too low (1.8) Offside front headlamp aim too low (1.8) 16 May 2011 [12:52] 16/05/2011 418166131159 418166131159
1 Nearside front windscreen wiper does not clear the windscreen effectively (8.2.2) Nearside front windscreen wiper does not clear the windscreen effectively (8.2.2) 16 May 2011 [12:52] 16/05/2011 418166131159 418166131159
1 Offside front windscreen wiper does not clear the windscreen effectively (8.2.2) Offside front windscreen wiper does not clear the windscreen effectively (8.2.2) 16 May 2011 [12:52] 16/05/2011 418166131159 418166131159
1 Offside steering rack gaiter split (2.2.d.2d) Offside steering rack gaiter split (2.2.d.2d) 16 May 2011 [12:52] 16/05/2011 418166131159 418166131159
1 Nearside front suspension has a suspension lower ball joint securing nut loose (2.5.b.1a) Nearside front suspension has a suspension lower ball joint securing nut loose (2.5.b.1a) 16 May 2011 [12:52] 16/05/2011 418166131159 418166131159
1 Offside front suspension has a suspension lower ball joint securing nut loose (2.5.b.1a) Offside front suspension has a suspension lower ball joint securing nut loose (2.5.b.1a) 16 May 2011 [12:52] 16/05/2011 418166131159 418166131159
1 Nearside front constant velocity joint gaiter insecurely mounted to its housing (2.5.c.1a) Nearside front constant velocity joint gaiter insecurely mounted to its housing (2.5.c.1a) 16 May 2011 [12:52] 16/05/2011 418166131159 418166131159
1 Offside front constant velocity joint gaiter insecurely mounted to its housing (2.5.c.1a) Offside front constant velocity joint gaiter insecurely mounted to its housing (2.5.c.1a) 16 May 2011 [12:52] 16/05/2011 418166131159 418166131159
1 Front exhaust system not adequately supported (7.1.1) Front exhaust system not adequately supported (7.1.1) 16 May 2011 [12:52] 16/05/2011 418166131159 418166131159
1 Steering system excessively tight (2.2.d.1) Steering system excessively tight (2.2.d.1) 16 May 2011 [12:52] 16/05/2011 418166131159 418166131159
1 Offside suspension component mounting prescribed area is inadequately repaired (2.4.a.3) Offside suspension component mounting prescribed area is inadequately repaired (2.4.a.3) 16 May 2011 [12:52] 16/05/2011 418166131159 418166131159
1 Nearside suspension component mounting prescribed area is inadequately repaired (2.4.a.3) Nearside suspension component mounting prescribed area is inadequately repaired (2.4.a.3) 16 May 2011 [12:52] 16/05/2011 418166131159 418166131159

ALL JHY 182P User Entered Faults [4]

ALL User Entered faults, ORDERED by OCCURRENCE DURING JHY 182P's MOT HISTORY
ALL JHY 182P User Entered Faults [4]
ALL User Entered faults, ORDERED by OCCURRENCE DURING JHY 182P's MOT HISTORY
Fail Faults | source www.vehiclestats.co.uk
Fault Fault Test Date Test Date/Time Reference MOT Test Reference
1 Steering column slight play Steering column slight play 05 March 2014 [11:30] 05/03/2014 878504964083 878504964083
1 Main beam tell-tale faulty Main beam tell-tale faulty 16 May 2011 [12:52] 16/05/2011 418166131159 418166131159
1 Sterring column has play Sterring column has play 16 May 2011 [12:52] 16/05/2011 418166131159 418166131159
1 No rear seats No rear seats 16 May 2011 [12:52] 16/05/2011 418166131159 418166131159

MOT TEST: 10 April 2017 12:35:22 PASSED
MOT TEST: 10 April 2017 12:35:22 PASSED

This test (755089548784) was completed on the 10 April 2017 12:35:22 and PASSED the requirements for a valid MOT with 5 comments.

This test (755089548784) was completed on the 10 April 2017 12:35:22 and PASSED the requirements for a valid MOT with 5 comments.

Recorded mileage: 36,741

Recorded mileage: 36,741


ADVISORY


MOT TEST: 18 March 2014 15:43:49 PASSED
MOT TEST: 18 March 2014 15:43:49 PASSED

This test (135847474449) was completed on the 18 March 2014 15:43:49 and PASSED the requirements for a valid MOT with 0 comments.

This test (135847474449) was completed on the 18 March 2014 15:43:49 and PASSED the requirements for a valid MOT with 0 comments.

Recorded mileage: 33,584

Recorded mileage: 33,584


MOT TEST: 05 March 2014 11:30:05 FAILED
MOT TEST: 05 March 2014 11:30:05 FAILED

This test (878504964083) was completed on the 05 March 2014 11:30:05 and FAILED the requirements for a valid MOT with 5 comments.

This test (878504964083) was completed on the 05 March 2014 11:30:05 and FAILED the requirements for a valid MOT with 5 comments.

Recorded mileage: 33,578

Recorded mileage: 33,578


FAIL

USER ENTERED


MOT TEST: 26 May 2011 16:17:29 PASSED
MOT TEST: 26 May 2011 16:17:29 PASSED

This test (989206041135) was completed on the 26 May 2011 16:17:29 and PASSED the requirements for a valid MOT with 0 comments.

This test (989206041135) was completed on the 26 May 2011 16:17:29 and PASSED the requirements for a valid MOT with 0 comments.

Recorded mileage: 33,063

Recorded mileage: 33,063


MOT TEST: 16 May 2011 12:52:25 FAILED
MOT TEST: 16 May 2011 12:52:25 FAILED

This test (418166131159) was completed on the 16 May 2011 12:52:25 and FAILED the requirements for a valid MOT with 19 comments.

This test (418166131159) was completed on the 16 May 2011 12:52:25 and FAILED the requirements for a valid MOT with 19 comments.

Recorded mileage: 33,053

Recorded mileage: 33,053


FAIL

USER ENTERED