JHY 523E


JHY523E is registered to a Black 1967, Morris 1000 pick up with a Petrol engine. It Failed its most recent MOT Test on the 18 October 2013

70 unique faults (82 Total) reported in its MOT History (13 Tests).

12 common/recurring faults, the most frequent (2 times) is: Steering column top bearing slightly worn (2.1.2c).

46% (6) MOT Pass Rate and a 54% (7) MOT Failure Rate.

98,729 recorded miles.

JHY 523E


JHY523E is registered to a Black 1967, Morris 1000 pick up with a Petrol engine. It Failed its most recent MOT Test on the 18 October 2013

70 unique faults (82 Total) reported in its MOT History (13 Tests).

12 common/recurring faults, the most frequent (2 times) is: Steering column top bearing slightly worn (2.1.2c).

46% (6) MOT Pass Rate and a 54% (7) MOT Failure Rate.

98,729 recorded miles.

MOT PASS/Failure rate for JHY 523E

all MOT test results for JHY 523E represented as a percentage
MOT PASS/Failure rate for JHY 523E
all MOT test results for JHY 523E represented as a percentage

PERCENTAGE OF VEHICLE FAULTS WITH JHY 523E

ALL REPORTED FAULTS, DISPLAYED BY PERCENTAGE OF OCCURRENCE DURING ALL MOT TESTS
PERCENTAGE OF VEHICLE FAULTS WITH JHY 523E
ALL REPORTED FAULTS, DISPLAYED BY PERCENTAGE OF OCCURRENCE DURING ALL MOT TESTS
ADVISORY

FAIL

USER ENTERED

JHY 523E annual Faults by type

ALL REPORTED FAULTS, DISPLAYED over time and categorised by type
JHY 523E annual Faults by type
ALL REPORTED FAULTS, DISPLAYED over time and categorised by type

RECURRING FAULTS WITH JHY 523E

FAULTS THAT HAVE OCCURED MORE THAN ONCE DURING JHY 523E's MOT HISTORY
RECURRING FAULTS WITH JHY 523E
FAULTS THAT HAVE OCCURED MORE THAN ONCE DURING JHY 523E's MOT HISTORY
Fault Fault Test Date Test Date/Time Reference MOT Test Reference
2 Steering column top bearing slightly worn (2.1.2c) Steering column top bearing slightly worn (2.1.2c) 18 October 2013 [08:46] 18/10/2013 09 October 2013 [09:09] 09/10/2013 906731593252 906731593252 959332083284 959332083284
2 Nearside front wheel bearing has slight play (2.5.a.3c) Nearside front wheel bearing has slight play (2.5.a.3c) 18 October 2013 [08:46] 18/10/2013 09 October 2013 [09:09] 09/10/2013 906731593252 906731593252 959332083284 959332083284
2 Fuel pipe/s corroded Fuel pipe/s corroded 18 October 2013 [08:46] 18/10/2013 09 October 2013 [09:09] 09/10/2013 906731593252 906731593252 959332083284 959332083284
2 Bolts missing from gearbox crossframe Bolts missing from gearbox crossframe 18 October 2013 [08:46] 18/10/2013 09 October 2013 [09:09] 09/10/2013 906731593252 906731593252 959332083284 959332083284
2 Nearside front shock absorber has a light misting of oil (2.7.3) Nearside front shock absorber has a light misting of oil (2.7.3) 03 October 2012 [16:19] 03/10/2012 21 September 2012 [11:29] 21/09/2012 257557772296 257557772296 866325562272 866325562272
2 Offside front shock absorber has a light misting of oil (2.7.3) Offside front shock absorber has a light misting of oil (2.7.3) 03 October 2012 [16:19] 03/10/2012 21 September 2012 [11:29] 21/09/2012 257557772296 257557772296 866325562272 866325562272
2 Slight play in steering rack Slight play in steering rack 15 October 2010 [09:57] 15/10/2010 13 October 2010 [12:03] 13/10/2010 702488280232 702488280232 360066680290 360066680290
2 Clutch pedal rubber missing Clutch pedal rubber missing 15 October 2010 [09:57] 15/10/2010 13 October 2010 [12:03] 13/10/2010 702488280232 702488280232 360066680290 360066680290
2 O/s/r wheel bearing slight play O/s/r wheel bearing slight play 15 October 2010 [09:57] 15/10/2010 13 October 2010 [12:03] 13/10/2010 702488280232 702488280232 360066680290 360066680290
2 Parking brake: efficiency below requirements (3.7.b.7) Parking brake: efficiency below requirements (3.7.b.7) 13 October 2010 [12:03] 13/10/2010 24 September 2007 [10:19] 24/09/2007 360066680290 360066680290 782197267225 782197267225
2 All position lamps not working (1.1.a.3b) All position lamps not working (1.1.a.3b) 16 January 2008 [13:28] 16/01/2008 24 September 2007 [10:19] 24/09/2007 130436718423 130436718423 782197267225 782197267225
2 Direction indicators not working (1.4.a.2c) Direction indicators not working (1.4.a.2c) 16 January 2008 [13:28] 16/01/2008 24 September 2007 [10:19] 24/09/2007 130436718423 130436718423 782197267225 782197267225

ALL JHY 523E ADVISORIES [12]

ALL ADVISORIES, ORDERED by OCCURRENCE DURING JHY 523E's MOT HISTORY
ALL JHY 523E ADVISORIES [12]
ALL ADVISORIES, ORDERED by OCCURRENCE DURING JHY 523E's MOT HISTORY
Advisory Faults | source www.vehiclestats.co.uk
Fault Fault Test Date Test Date/Time Reference MOT Test Reference
2 Steering column top bearing slightly worn (2.1.2c) Steering column top bearing slightly worn (2.1.2c) 18 October 2013 [08:46] 18/10/2013 09 October 2013 [09:09] 09/10/2013 906731593252 906731593252 959332083284 959332083284
2 Nearside front wheel bearing has slight play (2.5.a.3c) Nearside front wheel bearing has slight play (2.5.a.3c) 18 October 2013 [08:46] 18/10/2013 09 October 2013 [09:09] 09/10/2013 906731593252 906731593252 959332083284 959332083284
2 Nearside front shock absorber has a light misting of oil (2.7.3) Nearside front shock absorber has a light misting of oil (2.7.3) 03 October 2012 [16:19] 03/10/2012 21 September 2012 [11:29] 21/09/2012 257557772296 257557772296 866325562272 866325562272
2 Offside front shock absorber has a light misting of oil (2.7.3) Offside front shock absorber has a light misting of oil (2.7.3) 03 October 2012 [16:19] 03/10/2012 21 September 2012 [11:29] 21/09/2012 257557772296 257557772296 866325562272 866325562272
1 Nearside front tyre worn close to the legal limit (4.1.e.1) Nearside front tyre worn close to the legal limit (4.1.e.1) 06 October 2011 [12:02] 06/10/2011 616069171269 616069171269
1 Offside rear wheel bearing has slight play (2.6.2) Offside rear wheel bearing has slight play (2.6.2) 02 December 2008 [16:02] 02/12/2008 461197538466 461197538466
1 Nearside track rod end ball joint has slight play (2.2.b.1f) Nearside track rod end ball joint has slight play (2.2.b.1f) 02 December 2008 [16:02] 02/12/2008 461197538466 461197538466
1 Offside track rod end ball joint has slight play (2.2.b.1f) Offside track rod end ball joint has slight play (2.2.b.1f) 02 December 2008 [16:02] 02/12/2008 461197538466 461197538466

ALL JHY 523E Failure Faults [56]

ALL Failure faults, ORDERED by OCCURRENCE DURING JHY 523E's MOT HISTORY
ALL JHY 523E Failure Faults [56]
ALL Failure faults, ORDERED by OCCURRENCE DURING JHY 523E's MOT HISTORY
Fail Faults | source www.vehiclestats.co.uk
Fault Fault Test Date Test Date/Time Reference MOT Test Reference
2 Parking brake: efficiency below requirements (3.7.b.7) Parking brake: efficiency below requirements (3.7.b.7) 13 October 2010 [12:03] 13/10/2010 24 September 2007 [10:19] 24/09/2007 360066680290 360066680290 782197267225 782197267225
2 All position lamps not working (1.1.a.3b) All position lamps not working (1.1.a.3b) 16 January 2008 [13:28] 16/01/2008 24 September 2007 [10:19] 24/09/2007 130436718423 130436718423 782197267225 782197267225
2 Direction indicators not working (1.4.a.2c) Direction indicators not working (1.4.a.2c) 16 January 2008 [13:28] 16/01/2008 24 September 2007 [10:19] 24/09/2007 130436718423 130436718423 782197267225 782197267225
1 Nearside headlamp aim too high (1.8) Nearside headlamp aim too high (1.8) 09 October 2013 [09:09] 09/10/2013 959332083284 959332083284
1 Fuel tank leaking (7.2.3) Fuel tank leaking (7.2.3) 09 October 2013 [09:09] 09/10/2013 959332083284 959332083284
1 Fuel cap/sealing device sealing washer missing (7.2.4c) Fuel cap/sealing device sealing washer missing (7.2.4c) 09 October 2013 [09:09] 09/10/2013 959332083284 959332083284
1 Nearside rear tyre tread depth below requirements of 1.6mm (4.1.e.1) Nearside rear tyre tread depth below requirements of 1.6mm (4.1.e.1) 09 October 2013 [09:09] 09/10/2013 959332083284 959332083284
1 Steering column movement between the shaft and steering wheel (2.1.2b) Steering column movement between the shaft and steering wheel (2.1.2b) 09 October 2013 [09:09] 09/10/2013 959332083284 959332083284
1 Rear stop lamp not working (1.2.1b) Rear stop lamp not working (1.2.1b) 21 September 2012 [11:29] 21/09/2012 866325562272 866325562272
1 Fuel system component leaking (7.2.3) Fuel system component leaking (7.2.3) 21 September 2012 [11:29] 21/09/2012 866325562272 866325562272
1 Rear service brake application uneven across the axle (3.7.d.2b) Rear service brake application uneven across the axle (3.7.d.2b) 21 September 2012 [11:29] 21/09/2012 866325562272 866325562272
1 Offside rear parking brake recording little or no effort (3.7.d.3a) Offside rear parking brake recording little or no effort (3.7.d.3a) 21 September 2012 [11:29] 21/09/2012 866325562272 866325562272
1 Parking brake: efficiency below requirements (3.7.d.4) Parking brake: efficiency below requirements (3.7.d.4) 21 September 2012 [11:29] 21/09/2012 866325562272 866325562272
1 Nearside front headlamp aim too low (1.8) Nearside front headlamp aim too low (1.8) 06 October 2011 [12:02] 06/10/2011 616069171269 616069171269
1 Front headlamp aim too low (1.8) Front headlamp aim too low (1.8) 06 October 2011 [12:02] 06/10/2011 616069171269 616069171269
1 Indicator tell tale inoperative (1.4.a.2a) Indicator tell tale inoperative (1.4.a.2a) 06 October 2011 [12:02] 06/10/2011 616069171269 616069171269
1 Registration plate deteriorated (6.3.1d) Registration plate deteriorated (6.3.1d) 06 October 2011 [12:02] 06/10/2011 616069171269 616069171269
1 Windscreen washer provides insufficient washer liquid (8.2.3) Windscreen washer provides insufficient washer liquid (8.2.3) 06 October 2011 [12:02] 06/10/2011 616069171269 616069171269
1 Rear leaf spring has excessive wear in an anchor pin and/or bush (2.4.b.2) Rear leaf spring has excessive wear in an anchor pin and/or bush (2.4.b.2) 06 October 2011 [12:02] 06/10/2011 616069171269 616069171269
1 Offside rear rear wheel bearing has excessive play (2.6.2) Offside rear rear wheel bearing has excessive play (2.6.2) 06 October 2011 [12:02] 06/10/2011 616069171269 616069171269
1 Nearside rear braking system leaking (3.6.a.1) Nearside rear braking system leaking (3.6.a.1) 06 October 2011 [12:02] 06/10/2011 616069171269 616069171269
1 Offside front passenger door does not latch securely closed (6.2.b.1a) Offside front passenger door does not latch securely closed (6.2.b.1a) 06 October 2011 [12:02] 06/10/2011 616069171269 616069171269
1 Offside rear vehicle structure has excessive corrosion, seriously affecting its strength within 30cm of the body mountings (6.1.b.2) Offside rear vehicle structure has excessive corrosion, seriously affecting its strength within 30cm of the body mountings (6.1.b.2) 06 October 2011 [12:02] 06/10/2011 616069171269 616069171269
1 Nearside front vehicle structure has excessive corrosion, seriously affecting its strength within 30cm of the body mountings (6.1.b.2) Nearside front vehicle structure has excessive corrosion, seriously affecting its strength within 30cm of the body mountings (6.1.b.2) 06 October 2011 [12:02] 06/10/2011 616069171269 616069171269
1 Exhaust emits excessive dense blue smoke during acceleration (7.3.a.2c) Exhaust emits excessive dense blue smoke during acceleration (7.3.a.2c) 06 October 2011 [12:02] 06/10/2011 616069171269 616069171269
1 Brakes imbalanced across an axle (3.7.b.5b) Brakes imbalanced across an axle (3.7.b.5b) 06 October 2011 [12:02] 06/10/2011 616069171269 616069171269
1 Steering wheel in a condition that hampers proper control (2.1.1) Steering wheel in a condition that hampers proper control (2.1.1) 13 October 2010 [12:03] 13/10/2010 360066680290 360066680290
1 Nearside steering rack gaiter split (2.2.d.2d) Nearside steering rack gaiter split (2.2.d.2d) 13 October 2010 [12:03] 13/10/2010 360066680290 360066680290
1 Nearside rear wheel bearing has excessive play (2.6.2) Nearside rear wheel bearing has excessive play (2.6.2) 13 October 2010 [12:03] 13/10/2010 360066680290 360066680290
1 Fuel cap/sealing device sealing washer deteriorated (7.2.4c) Fuel cap/sealing device sealing washer deteriorated (7.2.4c) 13 October 2010 [12:03] 13/10/2010 360066680290 360066680290
1 Nearside headlamp excessively deteriorated so that the light output is severely reduced (1.7.5a) Nearside headlamp excessively deteriorated so that the light output is severely reduced (1.7.5a) 13 October 2010 [12:03] 13/10/2010 360066680290 360066680290
1 Offside headlamp excessively deteriorated so that the light output is severely reduced (1.7.5a) Offside headlamp excessively deteriorated so that the light output is severely reduced (1.7.5a) 13 October 2010 [12:03] 13/10/2010 360066680290 360066680290
1 Drivers seat insecure (6.2.a.1) Drivers seat insecure (6.2.a.1) 09 December 2009 [10:05] 09/12/2009 644993449372 644993449372
1 Offside rear vehicle structure has excessive corrosion which adversely affects braking or steering (6.1.a.1) Offside rear vehicle structure has excessive corrosion which adversely affects braking or steering (6.1.a.1) 09 December 2009 [10:05] 09/12/2009 644993449372 644993449372
1 Nearside rear wheel bearing rough when rotated (2.6.1) Nearside rear wheel bearing rough when rotated (2.6.1) 09 December 2009 [10:05] 09/12/2009 644993449372 644993449372
1 Offside rear wheel bearing rough when rotated (2.6.1) Offside rear wheel bearing rough when rotated (2.6.1) 09 December 2009 [10:05] 09/12/2009 644993449372 644993449372
1 Registration plate lamp not working (1.1.5c) Registration plate lamp not working (1.1.5c) 16 January 2008 [13:28] 16/01/2008 130436718423 130436718423
1 Stop lamp not working (1.2.1b) Stop lamp not working (1.2.1b) 16 January 2008 [13:28] 16/01/2008 130436718423 130436718423
1 Rear reflector missing (1.5.1a) Rear reflector missing (1.5.1a) 16 January 2008 [13:28] 16/01/2008 130436718423 130436718423
1 Offside headlamp not working on dipped beam (1.7.5a) Offside headlamp not working on dipped beam (1.7.5a) 16 January 2008 [13:28] 16/01/2008 130436718423 130436718423
1 Headlamp not working on main beam (1.7.5a) Headlamp not working on main beam (1.7.5a) 16 January 2008 [13:28] 16/01/2008 130436718423 130436718423
1 Nearside windscreen washer provides insufficient washer liquid (8.2.3) Nearside windscreen washer provides insufficient washer liquid (8.2.3) 16 January 2008 [13:28] 16/01/2008 130436718423 130436718423
1 Fuel cap/sealing device sealing washer torn (7.2.4c) Fuel cap/sealing device sealing washer torn (7.2.4c) 16 January 2008 [13:28] 16/01/2008 130436718423 130436718423
1 Offside body or chassis has excessive corrosion, seriously affecting its strength within 30cm of the body mountings (6.1.b.2) Offside body or chassis has excessive corrosion, seriously affecting its strength within 30cm of the body mountings (6.1.b.2) 16 January 2008 [13:28] 16/01/2008 130436718423 130436718423
1 Horn not working (1.6.2a) Horn not working (1.6.2a) 24 September 2007 [10:19] 24/09/2007 782197267225 782197267225
1 Headlamp not working on dipped beam (1.7.5a) Headlamp not working on dipped beam (1.7.5a) 24 September 2007 [10:19] 24/09/2007 782197267225 782197267225
1 Nearside stop lamp not working (1.2.1b) Nearside stop lamp not working (1.2.1b) 24 September 2007 [10:19] 24/09/2007 782197267225 782197267225
1 Offside rear parking brake recording little or no effort (3.7.b.6a) Offside rear parking brake recording little or no effort (3.7.b.6a) 24 September 2007 [10:19] 24/09/2007 782197267225 782197267225
1 Parking brake lever has no reserve travel (3.1.6b) Parking brake lever has no reserve travel (3.1.6b) 24 September 2007 [10:19] 24/09/2007 782197267225 782197267225
1 Nearside front brake recording little or no effort (3.7.b.5a) Nearside front brake recording little or no effort (3.7.b.5a) 24 September 2007 [10:19] 24/09/2007 782197267225 782197267225
1 Nearside front braking system leaking (3.6.a.1) Nearside front braking system leaking (3.6.a.1) 24 September 2007 [10:19] 24/09/2007 782197267225 782197267225
1 Offside inner vehicle structure has excessive corrosion which adversely affects braking or steering (6.1.a.1) Offside inner vehicle structure has excessive corrosion which adversely affects braking or steering (6.1.a.1) 24 September 2007 [10:19] 24/09/2007 782197267225 782197267225
1 Service brake: efficiency below requirements (3.7.b.7) Service brake: efficiency below requirements (3.7.b.7) 24 September 2007 [10:19] 24/09/2007 782197267225 782197267225

ALL JHY 523E User Entered Faults [14]

ALL User Entered faults, ORDERED by OCCURRENCE DURING JHY 523E's MOT HISTORY
ALL JHY 523E User Entered Faults [14]
ALL User Entered faults, ORDERED by OCCURRENCE DURING JHY 523E's MOT HISTORY
Advisory Faults | source www.vehiclestats.co.uk
Fault Fault Test Date Test Date/Time Reference MOT Test Reference
2 Fuel pipe/s corroded Fuel pipe/s corroded 18 October 2013 [08:46] 18/10/2013 09 October 2013 [09:09] 09/10/2013 906731593252 906731593252 959332083284 959332083284
2 Bolts missing from gearbox crossframe Bolts missing from gearbox crossframe 18 October 2013 [08:46] 18/10/2013 09 October 2013 [09:09] 09/10/2013 906731593252 906731593252 959332083284 959332083284
2 Slight play in steering rack Slight play in steering rack 15 October 2010 [09:57] 15/10/2010 13 October 2010 [12:03] 13/10/2010 702488280232 702488280232 360066680290 360066680290
2 Clutch pedal rubber missing Clutch pedal rubber missing 15 October 2010 [09:57] 15/10/2010 13 October 2010 [12:03] 13/10/2010 702488280232 702488280232 360066680290 360066680290
2 O/s/r wheel bearing slight play O/s/r wheel bearing slight play 15 October 2010 [09:57] 15/10/2010 13 October 2010 [12:03] 13/10/2010 702488280232 702488280232 360066680290 360066680290
1 O/s/f mirror missing O/s/f mirror missing 06 October 2011 [12:02] 06/10/2011 616069171269 616069171269
1 Slight play in rear differential Slight play in rear differential 15 October 2010 [09:57] 15/10/2010 702488280232 702488280232
1 Rear number plate deteriorating Rear number plate deteriorating 15 October 2010 [09:57] 15/10/2010 702488280232 702488280232
1 N/s/f door stiff to open, sticking N/s/f door stiff to open, sticking 13 October 2010 [12:03] 13/10/2010 360066680290 360066680290

MOT TEST: 18 October 2013 08:46:40 PASSED
MOT TEST: 18 October 2013 08:46:40 PASSED

This test (906731593252) was completed on the 18 October 2013 08:46:40 and PASSED the requirements for a valid MOT with 4 comments.

This test (906731593252) was completed on the 18 October 2013 08:46:40 and PASSED the requirements for a valid MOT with 4 comments.

Recorded mileage: 3,354

Recorded mileage: 3,354


ADVISORY

USER ENTERED


MOT TEST: 09 October 2013 09:09:24 FAILED
MOT TEST: 09 October 2013 09:09:24 FAILED

This test (959332083284) was completed on the 09 October 2013 09:09:24 and FAILED the requirements for a valid MOT with 9 comments.

This test (959332083284) was completed on the 09 October 2013 09:09:24 and FAILED the requirements for a valid MOT with 9 comments.

Recorded mileage: 3,228

Recorded mileage: 3,228


ADVISORY

FAIL

USER ENTERED


MOT TEST: 03 October 2012 16:19:42 PASSED
MOT TEST: 03 October 2012 16:19:42 PASSED

This test (257557772296) was completed on the 03 October 2012 16:19:42 and PASSED the requirements for a valid MOT with 2 comments.

This test (257557772296) was completed on the 03 October 2012 16:19:42 and PASSED the requirements for a valid MOT with 2 comments.

Recorded mileage: 98,729

Recorded mileage: 98,729


ADVISORY


MOT TEST: 21 September 2012 11:29:50 FAILED
MOT TEST: 21 September 2012 11:29:50 FAILED

This test (866325562272) was completed on the 21 September 2012 11:29:50 and FAILED the requirements for a valid MOT with 7 comments.

This test (866325562272) was completed on the 21 September 2012 11:29:50 and FAILED the requirements for a valid MOT with 7 comments.

Recorded mileage: 98,561

Recorded mileage: 98,561


ADVISORY

FAIL


MOT TEST: 18 October 2011 17:26:56 PASSED
MOT TEST: 18 October 2011 17:26:56 PASSED

This test (798831891240) was completed on the 18 October 2011 17:26:56 and PASSED the requirements for a valid MOT with 0 comments.

This test (798831891240) was completed on the 18 October 2011 17:26:56 and PASSED the requirements for a valid MOT with 0 comments.

Recorded mileage: 93,635

Recorded mileage: 93,635


MOT TEST: 06 October 2011 12:02:55 FAILED
MOT TEST: 06 October 2011 12:02:55 FAILED

This test (616069171269) was completed on the 06 October 2011 12:02:55 and FAILED the requirements for a valid MOT with 15 comments.

This test (616069171269) was completed on the 06 October 2011 12:02:55 and FAILED the requirements for a valid MOT with 15 comments.

Recorded mileage: 93,497

Recorded mileage: 93,497


ADVISORY

FAIL

USER ENTERED


MOT TEST: 15 October 2010 09:57:55 PASSED
MOT TEST: 15 October 2010 09:57:55 PASSED

This test (702488280232) was completed on the 15 October 2010 09:57:55 and PASSED the requirements for a valid MOT with 5 comments.

This test (702488280232) was completed on the 15 October 2010 09:57:55 and PASSED the requirements for a valid MOT with 5 comments.

Recorded mileage: 88,645

Recorded mileage: 88,645


USER ENTERED


MOT TEST: 13 October 2010 12:03:48 FAILED
MOT TEST: 13 October 2010 12:03:48 FAILED

This test (360066680290) was completed on the 13 October 2010 12:03:48 and FAILED the requirements for a valid MOT with 11 comments.

This test (360066680290) was completed on the 13 October 2010 12:03:48 and FAILED the requirements for a valid MOT with 11 comments.

Recorded mileage: 88,613

Recorded mileage: 88,613


FAIL

USER ENTERED


MOT TEST: 11 December 2009 09:49:11 PASSED
MOT TEST: 11 December 2009 09:49:11 PASSED

This test (930315849367) was completed on the 11 December 2009 09:49:11 and PASSED the requirements for a valid MOT with 0 comments.

This test (930315849367) was completed on the 11 December 2009 09:49:11 and PASSED the requirements for a valid MOT with 0 comments.

Recorded mileage: 84,078

Recorded mileage: 84,078


MOT TEST: 09 December 2009 10:05:25 FAILED
MOT TEST: 09 December 2009 10:05:25 FAILED

This test (644993449372) was completed on the 09 December 2009 10:05:25 and FAILED the requirements for a valid MOT with 4 comments.

This test (644993449372) was completed on the 09 December 2009 10:05:25 and FAILED the requirements for a valid MOT with 4 comments.

Recorded mileage: 84,078

Recorded mileage: 84,078


FAIL


MOT TEST: 02 December 2008 16:02:56 PASSED
MOT TEST: 02 December 2008 16:02:56 PASSED

This test (461197538466) was completed on the 02 December 2008 16:02:56 and PASSED the requirements for a valid MOT with 3 comments.

This test (461197538466) was completed on the 02 December 2008 16:02:56 and PASSED the requirements for a valid MOT with 3 comments.

Recorded mileage: 81,303

Recorded mileage: 81,303


ADVISORY


MOT TEST: 16 January 2008 13:28:14 FAILED
MOT TEST: 16 January 2008 13:28:14 FAILED

This test (130436718423) was completed on the 16 January 2008 13:28:14 and FAILED the requirements for a valid MOT with 10 comments.

This test (130436718423) was completed on the 16 January 2008 13:28:14 and FAILED the requirements for a valid MOT with 10 comments.

Recorded mileage: 81,297

Recorded mileage: 81,297


FAIL


MOT TEST: 24 September 2007 10:19:32 FAILED
MOT TEST: 24 September 2007 10:19:32 FAILED

This test (782197267225) was completed on the 24 September 2007 10:19:32 and FAILED the requirements for a valid MOT with 12 comments.

This test (782197267225) was completed on the 24 September 2007 10:19:32 and FAILED the requirements for a valid MOT with 12 comments.

Recorded mileage: 81,297

Recorded mileage: 81,297


FAIL