JJO 923


JJO923 is registered to a Grey 1946, Morris 8 with a Petrol engine. It Failed its most recent MOT Test on the 11 May 2018

21 unique faults (22 Total) reported in its MOT History (15 Tests).

1 common/recurring faults.

67% (10) MOT Pass Rate and a 33% (5) MOT Failure Rate.

1,332 recorded miles.

JJO 923


JJO923 is registered to a Grey 1946, Morris 8 with a Petrol engine. It Failed its most recent MOT Test on the 11 May 2018

21 unique faults (22 Total) reported in its MOT History (15 Tests).

1 common/recurring faults.

67% (10) MOT Pass Rate and a 33% (5) MOT Failure Rate.

1,332 recorded miles.

MOT PASS/Failure rate for JJO 923

all MOT test results for JJO 923 represented as a percentage
MOT PASS/Failure rate for JJO 923
all MOT test results for JJO 923 represented as a percentage

PERCENTAGE OF VEHICLE FAULTS WITH JJO 923

ALL REPORTED FAULTS, DISPLAYED BY PERCENTAGE OF OCCURRENCE DURING ALL MOT TESTS
PERCENTAGE OF VEHICLE FAULTS WITH JJO 923
ALL REPORTED FAULTS, DISPLAYED BY PERCENTAGE OF OCCURRENCE DURING ALL MOT TESTS
ADVISORY

FAIL

PASS WITH RECTIFICATION

JJO 923 annual Faults by type

ALL REPORTED FAULTS, DISPLAYED over time and categorised by type
JJO 923 annual Faults by type
ALL REPORTED FAULTS, DISPLAYED over time and categorised by type

ALL JJO 923 ADVISORIES [9]

ALL ADVISORIES, ORDERED by OCCURRENCE DURING JJO 923's MOT HISTORY
ALL JJO 923 ADVISORIES [9]
ALL ADVISORIES, ORDERED by OCCURRENCE DURING JJO 923's MOT HISTORY
Advisory Faults | source www.vehiclestats.co.uk
Fault Fault Test Date Test Date/Time Reference MOT Test Reference
2 Nearside front front suspension has slight movement at a suspension ball joint (2.5.a.1c) Nearside front front suspension has slight movement at a suspension ball joint (2.5.a.1c) 02 October 2014 [16:51] 02/10/2014 02 October 2014 [12:49] 02/10/2014 437115074282 437115074282 669175374273 669175374273
1 Offside rear lower front suspension ball joint dust cover deteriorated, but preventing the ingress of dirt (2.4.g.2) Offside rear lower front suspension ball joint dust cover deteriorated, but preventing the ingress of dirt (2.4.g.2) 11 May 2018 [08:35] 11/05/2018 736014953035 736014953035
1 Offside front tyre cracking on side wall Offside front tyre cracking on side wall 11 May 2018 [08:35] 11/05/2018 736014953035 736014953035
1 Gearbox mount incorrect for vehicle Gearbox mount incorrect for vehicle 07 September 2017 [09:02] 07/09/2017 383777275410 383777275410
1 Offside front play in steering rack inner joint(s) () Offside front play in steering rack inner joint(s) () 07 September 2017 [09:02] 07/09/2017 383777275410 383777275410
1 Nearside front play in steering rack inner joint(s) () Nearside front play in steering rack inner joint(s) () 07 September 2017 [09:02] 07/09/2017 383777275410 383777275410
1 Offside front front wheel bearing has slight play (2.5.a.3c) Offside front front wheel bearing has slight play (2.5.a.3c) 07 September 2017 [09:02] 07/09/2017 383777275410 383777275410
1 Offside rear service and park brake low effort Offside rear service and park brake low effort 23 September 2015 [14:52] 23/09/2015 508508504779 508508504779

ALL JJO 923 Failure Faults [8]

ALL Failure faults, ORDERED by OCCURRENCE DURING JJO 923's MOT HISTORY
ALL JJO 923 Failure Faults [8]
ALL Failure faults, ORDERED by OCCURRENCE DURING JJO 923's MOT HISTORY
Fail Faults | source www.vehiclestats.co.uk
Fault Fault Test Date Test Date/Time Reference MOT Test Reference
1 Nearside front mechanical brake component has restricted free movement (3.5.1k) Nearside front mechanical brake component has restricted free movement (3.5.1k) 07 September 2017 [09:02] 07/09/2017 383777275410 383777275410
1 Rear brakes imbalanced across an axle axle 2 (3.7.b.5b) Rear brakes imbalanced across an axle axle 2 (3.7.b.5b) 23 September 2015 [14:52] 23/09/2015 508508504779 508508504779
1 Lower steering pivot point has excessive play steering column both universal joints (2.2.b.1g) Lower steering pivot point has excessive play steering column both universal joints (2.2.b.1g) 23 September 2015 [14:52] 23/09/2015 508508504779 508508504779
1 Brakes imbalanced across an axle (3.7.b.5b) Brakes imbalanced across an axle (3.7.b.5b) 02 October 2014 [12:49] 02/10/2014 669175374273 669175374273
1 Windscreen washer provides insufficient washer liquid (8.2.3) Windscreen washer provides insufficient washer liquid (8.2.3) 26 September 2006 [12:40] 26/09/2006 562649966238 562649966238
1 Offside steering rack gaiter split (2.2.d.2d) Offside steering rack gaiter split (2.2.d.2d) 26 September 2006 [12:40] 26/09/2006 562649966238 562649966238
1 Offside outer front suspension arm has excessive play in a ball joint (2.4.g.2) Offside outer front suspension arm has excessive play in a ball joint (2.4.g.2) 26 September 2006 [12:40] 26/09/2006 562649966238 562649966238
1 Parking brake: efficiency below requirements (3.7.c.1b) Parking brake: efficiency below requirements (3.7.c.1b) 26 September 2006 [12:40] 26/09/2006 562649966238 562649966238

ALL JJO 923 Pass With Rectification Faults [5]

ALL Pass With Rectification faults, ORDERED by OCCURRENCE DURING JJO 923's MOT HISTORY
ALL JJO 923 Pass With Rectification Faults [5]
ALL Pass With Rectification faults, ORDERED by OCCURRENCE DURING JJO 923's MOT HISTORY
Fail Faults | source www.vehiclestats.co.uk
Fault Fault Test Date Test Date/Time Reference MOT Test Reference
1 Offside steering rack gaiter insecure (2.2.d.2d) Offside steering rack gaiter insecure (2.2.d.2d) 23 September 2015 [14:52] 23/09/2015 508508504779 508508504779
1 Nearside front wheel bearing has excessive play (2.5.a.3c) Nearside front wheel bearing has excessive play (2.5.a.3c) 23 September 2015 [14:52] 23/09/2015 508508504779 508508504779
1 Offside front wheel bearing has excessive play (2.5.a.3c) Offside front wheel bearing has excessive play (2.5.a.3c) 23 September 2015 [14:52] 23/09/2015 508508504779 508508504779
1 Offside rear position lamp(s) not working (1.1.a.3b) Offside rear position lamp(s) not working (1.1.a.3b) 21 June 2011 [10:44] 21/06/2011 788872871118 788872871118
1 Offside direction indicators not working (1.4.a.2c) Offside direction indicators not working (1.4.a.2c) 21 June 2011 [10:44] 21/06/2011 788872871118 788872871118

MOT TEST: 11 May 2018 08:35:03 PASSED
MOT TEST: 11 May 2018 08:35:03 PASSED

This test (736014953035) was completed on the 11 May 2018 08:35:03 and PASSED the requirements for a valid MOT with 2 comments.

This test (736014953035) was completed on the 11 May 2018 08:35:03 and PASSED the requirements for a valid MOT with 2 comments.

Recorded mileage: 18

Recorded mileage: 18


ADVISORY


MOT TEST: 07 September 2017 09:02:34 FAILED
MOT TEST: 07 September 2017 09:02:34 FAILED

This test (383777275410) was completed on the 07 September 2017 09:02:34 and FAILED the requirements for a valid MOT with 5 comments.

This test (383777275410) was completed on the 07 September 2017 09:02:34 and FAILED the requirements for a valid MOT with 5 comments.

Recorded mileage: 0

Recorded mileage: 0


ADVISORY

FAIL


MOT TEST: 28 September 2015 15:43:16 PASSED
MOT TEST: 28 September 2015 15:43:16 PASSED

This test (815364392276) was completed on the 28 September 2015 15:43:16 and PASSED the requirements for a valid MOT with 0 comments.

This test (815364392276) was completed on the 28 September 2015 15:43:16 and PASSED the requirements for a valid MOT with 0 comments.

Recorded mileage: 0

Recorded mileage: 0


MOT TEST: 23 September 2015 14:52:06 FAILED
MOT TEST: 23 September 2015 14:52:06 FAILED

This test (508508504779) was completed on the 23 September 2015 14:52:06 and FAILED the requirements for a valid MOT with 6 comments.

This test (508508504779) was completed on the 23 September 2015 14:52:06 and FAILED the requirements for a valid MOT with 6 comments.

Recorded mileage: 0

Recorded mileage: 0


ADVISORY

FAIL

PASS WITH RECTIFICATION


MOT TEST: 02 October 2014 16:51:24 PASSED
MOT TEST: 02 October 2014 16:51:24 PASSED

This test (437115074282) was completed on the 02 October 2014 16:51:24 and PASSED the requirements for a valid MOT with 1 comments.

This test (437115074282) was completed on the 02 October 2014 16:51:24 and PASSED the requirements for a valid MOT with 1 comments.

Recorded mileage: 299

Recorded mileage: 299


ADVISORY


MOT TEST: 02 October 2014 12:49:23 FAILED
MOT TEST: 02 October 2014 12:49:23 FAILED

This test (669175374273) was completed on the 02 October 2014 12:49:23 and FAILED the requirements for a valid MOT with 2 comments.

This test (669175374273) was completed on the 02 October 2014 12:49:23 and FAILED the requirements for a valid MOT with 2 comments.

Recorded mileage: 299

Recorded mileage: 299


ADVISORY

FAIL


MOT TEST: 20 June 2012 14:51:42 PASSED
MOT TEST: 20 June 2012 14:51:42 PASSED

This test (286892072442) was completed on the 20 June 2012 14:51:42 and PASSED the requirements for a valid MOT with 0 comments.

This test (286892072442) was completed on the 20 June 2012 14:51:42 and PASSED the requirements for a valid MOT with 0 comments.

Recorded mileage: 1,332

Recorded mileage: 1,332


MOT TEST: 21 June 2011 10:44:06 PASSED
MOT TEST: 21 June 2011 10:44:06 PASSED

This test (609452571168) was completed on the 21 June 2011 10:44:06 and PASSED the requirements for a valid MOT with 0 comments.

This test (609452571168) was completed on the 21 June 2011 10:44:06 and PASSED the requirements for a valid MOT with 0 comments.

Recorded mileage: 999

Recorded mileage: 999


MOT TEST: 21 June 2011 10:44:06 FAILED
MOT TEST: 21 June 2011 10:44:06 FAILED

This test (788872871118) was completed on the 21 June 2011 10:44:06 and FAILED the requirements for a valid MOT with 2 comments.

This test (788872871118) was completed on the 21 June 2011 10:44:06 and FAILED the requirements for a valid MOT with 2 comments.

Recorded mileage: 999

Recorded mileage: 999


PASS WITH RECTIFICATION


MOT TEST: 14 June 2010 17:27:28 PASSED
MOT TEST: 14 June 2010 17:27:28 PASSED

This test (193215160198) was completed on the 14 June 2010 17:27:28 and PASSED the requirements for a valid MOT with 0 comments.

This test (193215160198) was completed on the 14 June 2010 17:27:28 and PASSED the requirements for a valid MOT with 0 comments.

Recorded mileage: 615

Recorded mileage: 615


MOT TEST: 22 June 2009 13:38:42 PASSED
MOT TEST: 22 June 2009 13:38:42 PASSED

This test (612873879100) was completed on the 22 June 2009 13:38:42 and PASSED the requirements for a valid MOT with 0 comments.

This test (612873879100) was completed on the 22 June 2009 13:38:42 and PASSED the requirements for a valid MOT with 0 comments.

Recorded mileage: 350

Recorded mileage: 350


MOT TEST: 24 June 2008 16:31:35 PASSED
MOT TEST: 24 June 2008 16:31:35 PASSED

This test (103506378140) was completed on the 24 June 2008 16:31:35 and PASSED the requirements for a valid MOT with 0 comments.

This test (103506378140) was completed on the 24 June 2008 16:31:35 and PASSED the requirements for a valid MOT with 0 comments.

Recorded mileage: 319

Recorded mileage: 319


MOT TEST: 09 June 2007 12:53:41 PASSED
MOT TEST: 09 June 2007 12:53:41 PASSED

This test (924910067143) was completed on the 09 June 2007 12:53:41 and PASSED the requirements for a valid MOT with 0 comments.

This test (924910067143) was completed on the 09 June 2007 12:53:41 and PASSED the requirements for a valid MOT with 0 comments.

Recorded mileage: 301

Recorded mileage: 301


MOT TEST: 26 September 2006 12:40:11 FAILED
MOT TEST: 26 September 2006 12:40:11 FAILED

This test (562649966238) was completed on the 26 September 2006 12:40:11 and FAILED the requirements for a valid MOT with 4 comments.

This test (562649966238) was completed on the 26 September 2006 12:40:11 and FAILED the requirements for a valid MOT with 4 comments.

Recorded mileage: 297

Recorded mileage: 297


FAIL


MOT TEST: 30 August 2005 12:30:35 PASSED
MOT TEST: 30 August 2005 12:30:35 PASSED

This test (971212545297) was completed on the 30 August 2005 12:30:35 and PASSED the requirements for a valid MOT with 0 comments.

This test (971212545297) was completed on the 30 August 2005 12:30:35 and PASSED the requirements for a valid MOT with 0 comments.

Recorded mileage: 277

Recorded mileage: 277