JKO 572E


JKO572E is registered to a White 1967, Morris Minor 1000 with a Petrol engine. It Failed its most recent MOT Test on the 30 April 2019

23 unique faults (25 Total) reported in its MOT History (8 Tests).

1 common/recurring faults.

50% (4) MOT Pass Rate and a 50% (4) MOT Failure Rate.

99,727 recorded miles.

JKO 572E


JKO572E is registered to a White 1967, Morris Minor 1000 with a Petrol engine. It Failed its most recent MOT Test on the 30 April 2019

23 unique faults (25 Total) reported in its MOT History (8 Tests).

1 common/recurring faults.

50% (4) MOT Pass Rate and a 50% (4) MOT Failure Rate.

99,727 recorded miles.

MOT PASS/Failure rate for JKO 572E

all MOT test results for JKO 572E represented as a percentage
MOT PASS/Failure rate for JKO 572E
all MOT test results for JKO 572E represented as a percentage

PERCENTAGE OF VEHICLE FAULTS WITH JKO 572E

ALL REPORTED FAULTS, DISPLAYED BY PERCENTAGE OF OCCURRENCE DURING ALL MOT TESTS
PERCENTAGE OF VEHICLE FAULTS WITH JKO 572E
ALL REPORTED FAULTS, DISPLAYED BY PERCENTAGE OF OCCURRENCE DURING ALL MOT TESTS
ADVISORY

FAIL

JKO 572E annual Faults by type

ALL REPORTED FAULTS, DISPLAYED over time and categorised by type
JKO 572E annual Faults by type
ALL REPORTED FAULTS, DISPLAYED over time and categorised by type

ALL JKO 572E ADVISORIES [1]

ALL ADVISORIES, ORDERED by OCCURRENCE DURING JKO 572E's MOT HISTORY
ALL JKO 572E ADVISORIES [1]
ALL ADVISORIES, ORDERED by OCCURRENCE DURING JKO 572E's MOT HISTORY
Fail Faults | source www.vehiclestats.co.uk
Fault Fault Test Date Test Date/Time Reference MOT Test Reference
1 Nearside front front suspension has slight play in a lower suspension ball joint (2.5.b.1a) Nearside front front suspension has slight play in a lower suspension ball joint (2.5.b.1a) 25 April 2006 [16:19] 25/04/2006 294705416158 294705416158

ALL JKO 572E Failure Faults [24]

ALL Failure faults, ORDERED by OCCURRENCE DURING JKO 572E's MOT HISTORY
ALL JKO 572E Failure Faults [24]
ALL Failure faults, ORDERED by OCCURRENCE DURING JKO 572E's MOT HISTORY
Fail Faults | source www.vehiclestats.co.uk
Fault Fault Test Date Test Date/Time Reference MOT Test Reference
2 Nearside rear suspension spring mounting prescribed area is excessively corroded (2.4.a.3) Nearside rear suspension spring mounting prescribed area is excessively corroded (2.4.a.3) 05 February 2008 [12:51] 05/02/2008 25 April 2006 [16:19] 25/04/2006 310666438092 310666438092 294705416158 294705416158
1 Rear brakes imbalanced across an axle (1.2.1 (b) (i)) Rear brakes imbalanced across an axle (1.2.1 (b) (i)) 30 April 2019 [11:20] 30/04/2019 110500932375 110500932375
1 Nearside rear service brake has no recorded effort at a wheel (1.2.1 (a) (ii)) Nearside rear service brake has no recorded effort at a wheel (1.2.1 (a) (ii)) 30 April 2019 [11:20] 30/04/2019 110500932375 110500932375
1 Nearside front seat belt anchorage prescribed area strength or continuity significantly reduced (7.1.1 (a) (i)) Nearside front seat belt anchorage prescribed area strength or continuity significantly reduced (7.1.1 (a) (i)) 30 April 2019 [11:20] 30/04/2019 110500932375 110500932375
1 Offside front seat belt anchorage likely to become detached in the event of a collision (7.1.1 (a) (ii)) Offside front seat belt anchorage likely to become detached in the event of a collision (7.1.1 (a) (ii)) 30 April 2019 [11:20] 30/04/2019 110500932375 110500932375
1 Offside rear suspension component mounting prescribed area excessively corroded significantly reducing structural strength outer sill (5.3.6 (a) (i)) Offside rear suspension component mounting prescribed area excessively corroded significantly reducing structural strength outer sill (5.3.6 (a) (i)) 30 April 2019 [11:20] 30/04/2019 110500932375 110500932375
1 Rear brakes imbalanced across an axle axle 2 (1.2.1 (b) (i)) Rear brakes imbalanced across an axle axle 2 (1.2.1 (b) (i)) 30 April 2019 [11:20] 30/04/2019 110500932375 110500932375
1 Offside headlamp not working on dipped beam (1.7.5a) Offside headlamp not working on dipped beam (1.7.5a) 01 June 2010 [16:25] 01/06/2010 753202650107 753202650107
1 Front brake application uneven (3.7.b.2) Front brake application uneven (3.7.b.2) 01 June 2010 [16:25] 01/06/2010 753202650107 753202650107
1 Nearside headlamp not working on dipped beam (1.7.5a) Nearside headlamp not working on dipped beam (1.7.5a) 05 February 2008 [12:51] 05/02/2008 310666438092 310666438092
1 Offside rear seat belt anchorage prescribed area is excessively corroded (5.2.6) Offside rear seat belt anchorage prescribed area is excessively corroded (5.2.6) 25 April 2006 [16:19] 25/04/2006 294705416158 294705416158
1 Offside rear suspension spring mounting prescribed area is inadequately repaired (2.4.a.3) Offside rear suspension spring mounting prescribed area is inadequately repaired (2.4.a.3) 25 April 2006 [16:19] 25/04/2006 294705416158 294705416158
1 Nearside rear suspension spring mounting prescribed area is inadequately repaired (2.4.a.3) Nearside rear suspension spring mounting prescribed area is inadequately repaired (2.4.a.3) 25 April 2006 [16:19] 25/04/2006 294705416158 294705416158
1 Offside suspension spring mounting prescribed area is excessively corroded (2.4.a.3) Offside suspension spring mounting prescribed area is excessively corroded (2.4.a.3) 25 April 2006 [16:19] 25/04/2006 294705416158 294705416158
1 Offside front suspension spring mounting prescribed area is inadequately repaired (2.4.a.3) Offside front suspension spring mounting prescribed area is inadequately repaired (2.4.a.3) 25 April 2006 [16:19] 25/04/2006 294705416158 294705416158
1 Offside front suspension spring mounting prescribed area is excessively corroded (2.4.a.3) Offside front suspension spring mounting prescribed area is excessively corroded (2.4.a.3) 25 April 2006 [16:19] 25/04/2006 294705416158 294705416158
1 Nearside steering rack gaiter split (2.2.d.2d) Nearside steering rack gaiter split (2.2.d.2d) 25 April 2006 [16:19] 25/04/2006 294705416158 294705416158
1 Offside rear tyre has a cut in excess of the requirements deep enough to reach the ply or cords (4.1.d.1a) Offside rear tyre has a cut in excess of the requirements deep enough to reach the ply or cords (4.1.d.1a) 25 April 2006 [16:19] 25/04/2006 294705416158 294705416158
1 Offside rear tyre has a lump, caused by separation or partial failure of its structure (4.1.d.1b) Offside rear tyre has a lump, caused by separation or partial failure of its structure (4.1.d.1b) 25 April 2006 [16:19] 25/04/2006 294705416158 294705416158
1 Nearside front tyre has a cut in excess of the requirements deep enough to reach the ply or cords (4.1.d.1a) Nearside front tyre has a cut in excess of the requirements deep enough to reach the ply or cords (4.1.d.1a) 25 April 2006 [16:19] 25/04/2006 294705416158 294705416158
1 Fuel cap/sealing device sealing washer missing (7.2.4c) Fuel cap/sealing device sealing washer missing (7.2.4c) 25 April 2006 [16:19] 25/04/2006 294705416158 294705416158
1 Front passenger seat insecure (6.2.3) Front passenger seat insecure (6.2.3) 25 April 2006 [16:19] 25/04/2006 294705416158 294705416158

MOT TEST: 30 April 2019 11:20:05 FAILED
MOT TEST: 30 April 2019 11:20:05 FAILED

This test (110500932375) was completed on the 30 April 2019 11:20:05 and FAILED the requirements for a valid MOT with 6 comments.

This test (110500932375) was completed on the 30 April 2019 11:20:05 and FAILED the requirements for a valid MOT with 6 comments.

Recorded mileage: 717

Recorded mileage: 717


FAIL


MOT TEST: 04 April 2018 06:58:37 PASSED
MOT TEST: 04 April 2018 06:58:37 PASSED

This test (477260429429) was completed on the 04 April 2018 06:58:37 and PASSED the requirements for a valid MOT with 0 comments.

This test (477260429429) was completed on the 04 April 2018 06:58:37 and PASSED the requirements for a valid MOT with 0 comments.

Recorded mileage: 227

Recorded mileage: 227


MOT TEST: 03 June 2010 11:54:14 PASSED
MOT TEST: 03 June 2010 11:54:14 PASSED

This test (862194450162) was completed on the 03 June 2010 11:54:14 and PASSED the requirements for a valid MOT with 0 comments.

This test (862194450162) was completed on the 03 June 2010 11:54:14 and PASSED the requirements for a valid MOT with 0 comments.

Recorded mileage: 99,727

Recorded mileage: 99,727


MOT TEST: 01 June 2010 16:25:08 FAILED
MOT TEST: 01 June 2010 16:25:08 FAILED

This test (753202650107) was completed on the 01 June 2010 16:25:08 and FAILED the requirements for a valid MOT with 2 comments.

This test (753202650107) was completed on the 01 June 2010 16:25:08 and FAILED the requirements for a valid MOT with 2 comments.

Recorded mileage: 99,727

Recorded mileage: 99,727


FAIL


MOT TEST: 15 February 2008 15:14:51 PASSED
MOT TEST: 15 February 2008 15:14:51 PASSED

This test (770616948091) was completed on the 15 February 2008 15:14:51 and PASSED the requirements for a valid MOT with 0 comments.

This test (770616948091) was completed on the 15 February 2008 15:14:51 and PASSED the requirements for a valid MOT with 0 comments.

Recorded mileage: 99,068

Recorded mileage: 99,068


MOT TEST: 05 February 2008 12:51:55 FAILED
MOT TEST: 05 February 2008 12:51:55 FAILED

This test (310666438092) was completed on the 05 February 2008 12:51:55 and FAILED the requirements for a valid MOT with 2 comments.

This test (310666438092) was completed on the 05 February 2008 12:51:55 and FAILED the requirements for a valid MOT with 2 comments.

Recorded mileage: 99,068

Recorded mileage: 99,068


FAIL


MOT TEST: 30 May 2006 15:22:55 PASSED
MOT TEST: 30 May 2006 15:22:55 PASSED

This test (472930356157) was completed on the 30 May 2006 15:22:55 and PASSED the requirements for a valid MOT with 0 comments.

This test (472930356157) was completed on the 30 May 2006 15:22:55 and PASSED the requirements for a valid MOT with 0 comments.

Recorded mileage: 96,829

Recorded mileage: 96,829


MOT TEST: 25 April 2006 16:19:19 FAILED
MOT TEST: 25 April 2006 16:19:19 FAILED

This test (294705416158) was completed on the 25 April 2006 16:19:19 and FAILED the requirements for a valid MOT with 15 comments.

This test (294705416158) was completed on the 25 April 2006 16:19:19 and FAILED the requirements for a valid MOT with 15 comments.

Recorded mileage: 96,817

Recorded mileage: 96,817


ADVISORY

FAIL