JKR 980E


JKR980E is registered to a Grey 1967, Morris Minor 1000 with a Petrol engine. It Passed its most recent MOT Test on the 11 June 2018

23 unique faults (28 Total) reported in its MOT History (18 Tests).

3 common/recurring faults, the most frequent (2 times) is: Offside front brake binding (3.7.B.1).

72% (13) MOT Pass Rate and a 28% (5) MOT Failure Rate.

39,371 recorded miles.

JKR 980E


JKR980E is registered to a Grey 1967, Morris Minor 1000 with a Petrol engine. It Passed its most recent MOT Test on the 11 June 2018

23 unique faults (28 Total) reported in its MOT History (18 Tests).

3 common/recurring faults, the most frequent (2 times) is: Offside front brake binding (3.7.B.1).

72% (13) MOT Pass Rate and a 28% (5) MOT Failure Rate.

39,371 recorded miles.

MOT PASS/Failure rate for JKR 980E

all MOT test results for JKR 980E represented as a percentage
MOT PASS/Failure rate for JKR 980E
all MOT test results for JKR 980E represented as a percentage

PERCENTAGE OF VEHICLE FAULTS WITH JKR 980E

ALL REPORTED FAULTS, DISPLAYED BY PERCENTAGE OF OCCURRENCE DURING ALL MOT TESTS
PERCENTAGE OF VEHICLE FAULTS WITH JKR 980E
ALL REPORTED FAULTS, DISPLAYED BY PERCENTAGE OF OCCURRENCE DURING ALL MOT TESTS
FAIL

USER ENTERED

MINOR

JKR 980E annual Faults by type

ALL REPORTED FAULTS, DISPLAYED over time and categorised by type
JKR 980E annual Faults by type
ALL REPORTED FAULTS, DISPLAYED over time and categorised by type

RECURRING FAULTS WITH JKR 980E

FAULTS THAT HAVE OCCURED MORE THAN ONCE DURING JKR 980E's MOT HISTORY
RECURRING FAULTS WITH JKR 980E
FAULTS THAT HAVE OCCURED MORE THAN ONCE DURING JKR 980E's MOT HISTORY
Fault Fault Test Date Test Date/Time Reference MOT Test Reference
2 Offside front brake binding (3.7.b.1) Offside front brake binding (3.7.b.1) 05 June 2017 [09:09] 05/06/2017 19 July 2007 [10:38] 19/07/2007 509829500761 509829500761 194880607269 194880607269
2 Advise hand brake travel Advise hand brake travel 27 June 2013 [12:52] 27/06/2013 27 June 2013 [10:34] 27/06/2013 905678473108 905678473108 587228173144 587228173144
2 Registration plate lamp not working (1.1.c.1d) Registration plate lamp not working (1.1.c.1d) 27 June 2013 [10:34] 27/06/2013 02 July 2012 [12:39] 02/07/2012 587228173144 587228173144 869954082166 869954082166

ALL JKR 980E Failure Faults [25]

ALL Failure faults, ORDERED by OCCURRENCE DURING JKR 980E's MOT HISTORY
ALL JKR 980E Failure Faults [25]
ALL Failure faults, ORDERED by OCCURRENCE DURING JKR 980E's MOT HISTORY
Fail Faults | source www.vehiclestats.co.uk
Fault Fault Test Date Test Date/Time Reference MOT Test Reference
2 Offside front brake binding (3.7.b.1) Offside front brake binding (3.7.b.1) 05 June 2017 [09:09] 05/06/2017 19 July 2007 [10:38] 19/07/2007 509829500761 509829500761 194880607269 194880607269
2 Registration plate lamp not working (1.1.c.1d) Registration plate lamp not working (1.1.c.1d) 27 June 2013 [10:34] 27/06/2013 02 July 2012 [12:39] 02/07/2012 587228173144 587228173144 869954082166 869954082166
1 Nearside headlamp not working on main beam (4.1.1 (a) (ii)) Nearside headlamp not working on main beam (4.1.1 (a) (ii)) 11 June 2018 [09:41] 11/06/2018 608563164232 608563164232
1 Offside headlamp not working on main beam (4.1.1 (a) (ii)) Offside headlamp not working on main beam (4.1.1 (a) (ii)) 11 June 2018 [09:41] 11/06/2018 608563164232 608563164232
1 Registration plate lamp does not illuminate simultaneously with the position lamps (4.7.2 (a)) Registration plate lamp does not illuminate simultaneously with the position lamps (4.7.2 (a)) 11 June 2018 [09:41] 11/06/2018 608563164232 608563164232
1 Front brakes imbalanced across an axle (3.7.b.5b) Front brakes imbalanced across an axle (3.7.b.5b) 05 June 2017 [09:09] 05/06/2017 509829500761 509829500761
1 Horn not working (1.6.2a) Horn not working (1.6.2a) 27 June 2013 [10:34] 27/06/2013 587228173144 587228173144
1 Nearside headlamp not working on dipped beam (1.7.5a) Nearside headlamp not working on dipped beam (1.7.5a) 27 June 2013 [10:34] 27/06/2013 587228173144 587228173144
1 Nearside headlamp not working on main beam (1.7.5a) Nearside headlamp not working on main beam (1.7.5a) 27 June 2013 [10:34] 27/06/2013 587228173144 587228173144
1 Offside headlamp not working on main beam (1.7.5a) Offside headlamp not working on main beam (1.7.5a) 27 June 2013 [10:34] 27/06/2013 587228173144 587228173144
1 Headlamp aim not tested (1.8.a.1c) Headlamp aim not tested (1.8.a.1c) 27 June 2013 [10:34] 27/06/2013 587228173144 587228173144
1 Nearside front direction indicator not working (1.4.a.2c) Nearside front direction indicator not working (1.4.a.2c) 02 July 2012 [12:39] 02/07/2012 869954082166 869954082166
1 Offside rear direction indicator not working (1.4.a.2c) Offside rear direction indicator not working (1.4.a.2c) 02 July 2012 [12:39] 02/07/2012 869954082166 869954082166
1 Nearside windscreen washer provides insufficient washer liquid (8.2.3) Nearside windscreen washer provides insufficient washer liquid (8.2.3) 02 July 2012 [12:39] 02/07/2012 869954082166 869954082166
1 Offside windscreen washer provides insufficient washer liquid (8.2.3) Offside windscreen washer provides insufficient washer liquid (8.2.3) 02 July 2012 [12:39] 02/07/2012 869954082166 869954082166
1 Offside front suspension component mounting prescribed area is excessively corroded (2.4.a.3) Offside front suspension component mounting prescribed area is excessively corroded (2.4.a.3) 19 July 2007 [10:38] 19/07/2007 194880607269 194880607269
1 Offside suspension component mounting prescribed area is excessively corroded (2.4.a.3) Offside suspension component mounting prescribed area is excessively corroded (2.4.a.3) 19 July 2007 [10:38] 19/07/2007 194880607269 194880607269
1 Offside rear suspension component mounting prescribed area is excessively corroded (2.4.a.3) Offside rear suspension component mounting prescribed area is excessively corroded (2.4.a.3) 19 July 2007 [10:38] 19/07/2007 194880607269 194880607269
1 Nearside rear suspension component mounting prescribed area is excessively corroded (2.4.a.3) Nearside rear suspension component mounting prescribed area is excessively corroded (2.4.a.3) 19 July 2007 [10:38] 19/07/2007 194880607269 194880607269
1 Nearside front suspension component mounting prescribed area is excessively corroded (2.4.a.3) Nearside front suspension component mounting prescribed area is excessively corroded (2.4.a.3) 19 July 2007 [10:38] 19/07/2007 194880607269 194880607269
1 Brakes imbalanced across an axle (3.7.b.5b) Brakes imbalanced across an axle (3.7.b.5b) 19 July 2007 [10:38] 19/07/2007 194880607269 194880607269

ALL JKR 980E minor Faults [1]

ALL minor faults, ORDERED by OCCURRENCE DURING JKR 980E's MOT HISTORY
ALL JKR 980E minor Faults [1]
ALL minor faults, ORDERED by OCCURRENCE DURING JKR 980E's MOT HISTORY
Fail Faults | source www.vehiclestats.co.uk
Fault Fault Test Date Test Date/Time Reference MOT Test Reference
1 Indicator tell-tale inoperative (4.9.1 (a) (i)) Indicator tell-tale inoperative (4.9.1 (a) (i)) 11 June 2018 [09:41] 11/06/2018 608563164232 608563164232

ALL JKR 980E User Entered Faults [2]

ALL User Entered faults, ORDERED by OCCURRENCE DURING JKR 980E's MOT HISTORY
ALL JKR 980E User Entered Faults [2]
ALL User Entered faults, ORDERED by OCCURRENCE DURING JKR 980E's MOT HISTORY
User Entered Faults | source www.vehiclestats.co.uk
Fault Fault Test Date Test Date/Time Reference MOT Test Reference
2 Advise hand brake travel Advise hand brake travel 27 June 2013 [12:52] 27/06/2013 27 June 2013 [10:34] 27/06/2013 905678473108 905678473108 587228173144 587228173144

MOT TEST: 11 June 2018 13:44:19 PASSED
MOT TEST: 11 June 2018 13:44:19 PASSED

This test (344251587094) was completed on the 11 June 2018 13:44:19 and PASSED the requirements for a valid MOT with 0 comments.

This test (344251587094) was completed on the 11 June 2018 13:44:19 and PASSED the requirements for a valid MOT with 0 comments.

Recorded mileage: 5,133

Recorded mileage: 5,133


MOT TEST: 11 June 2018 09:41:48 FAILED
MOT TEST: 11 June 2018 09:41:48 FAILED

This test (608563164232) was completed on the 11 June 2018 09:41:48 and FAILED the requirements for a valid MOT with 4 comments.

This test (608563164232) was completed on the 11 June 2018 09:41:48 and FAILED the requirements for a valid MOT with 4 comments.

Recorded mileage: 5,133

Recorded mileage: 5,133


FAIL

MINOR


MOT TEST: 05 June 2017 14:43:28 PASSED
MOT TEST: 05 June 2017 14:43:28 PASSED

This test (399200300611) was completed on the 05 June 2017 14:43:28 and PASSED the requirements for a valid MOT with 0 comments.

This test (399200300611) was completed on the 05 June 2017 14:43:28 and PASSED the requirements for a valid MOT with 0 comments.

Recorded mileage: 4,994

Recorded mileage: 4,994


MOT TEST: 05 June 2017 09:09:54 FAILED
MOT TEST: 05 June 2017 09:09:54 FAILED

This test (509829500761) was completed on the 05 June 2017 09:09:54 and FAILED the requirements for a valid MOT with 2 comments.

This test (509829500761) was completed on the 05 June 2017 09:09:54 and FAILED the requirements for a valid MOT with 2 comments.

Recorded mileage: 4,994

Recorded mileage: 4,994


FAIL


MOT TEST: 13 June 2016 08:43:42 PASSED
MOT TEST: 13 June 2016 08:43:42 PASSED

This test (491277755755) was completed on the 13 June 2016 08:43:42 and PASSED the requirements for a valid MOT with 0 comments.

This test (491277755755) was completed on the 13 June 2016 08:43:42 and PASSED the requirements for a valid MOT with 0 comments.

Recorded mileage: 4,763

Recorded mileage: 4,763


MOT TEST: 13 July 2015 11:06:37 PASSED
MOT TEST: 13 July 2015 11:06:37 PASSED

This test (758894595187) was completed on the 13 July 2015 11:06:37 and PASSED the requirements for a valid MOT with 0 comments.

This test (758894595187) was completed on the 13 July 2015 11:06:37 and PASSED the requirements for a valid MOT with 0 comments.

Recorded mileage: 4,571

Recorded mileage: 4,571


MOT TEST: 10 July 2014 11:25:18 PASSED
MOT TEST: 10 July 2014 11:25:18 PASSED

This test (698161994159) was completed on the 10 July 2014 11:25:18 and PASSED the requirements for a valid MOT with 0 comments.

This test (698161994159) was completed on the 10 July 2014 11:25:18 and PASSED the requirements for a valid MOT with 0 comments.

Recorded mileage: 4,425

Recorded mileage: 4,425


MOT TEST: 27 June 2013 12:52:34 PASSED
MOT TEST: 27 June 2013 12:52:34 PASSED

This test (905678473108) was completed on the 27 June 2013 12:52:34 and PASSED the requirements for a valid MOT with 1 comments.

This test (905678473108) was completed on the 27 June 2013 12:52:34 and PASSED the requirements for a valid MOT with 1 comments.

Recorded mileage: 4,243

Recorded mileage: 4,243


USER ENTERED


MOT TEST: 27 June 2013 10:34:12 FAILED
MOT TEST: 27 June 2013 10:34:12 FAILED

This test (587228173144) was completed on the 27 June 2013 10:34:12 and FAILED the requirements for a valid MOT with 7 comments.

This test (587228173144) was completed on the 27 June 2013 10:34:12 and FAILED the requirements for a valid MOT with 7 comments.

Recorded mileage: 4,243

Recorded mileage: 4,243


FAIL

USER ENTERED


MOT TEST: 02 July 2012 16:25:20 PASSED
MOT TEST: 02 July 2012 16:25:20 PASSED

This test (235524382437) was completed on the 02 July 2012 16:25:20 and PASSED the requirements for a valid MOT with 0 comments.

This test (235524382437) was completed on the 02 July 2012 16:25:20 and PASSED the requirements for a valid MOT with 0 comments.

Recorded mileage: 39,371

Recorded mileage: 39,371


MOT TEST: 02 July 2012 12:39:44 FAILED
MOT TEST: 02 July 2012 12:39:44 FAILED

This test (869954082166) was completed on the 02 July 2012 12:39:44 and FAILED the requirements for a valid MOT with 5 comments.

This test (869954082166) was completed on the 02 July 2012 12:39:44 and FAILED the requirements for a valid MOT with 5 comments.

Recorded mileage: 39,371

Recorded mileage: 39,371


FAIL


MOT TEST: 30 June 2011 11:22:03 PASSED
MOT TEST: 30 June 2011 11:22:03 PASSED

This test (455891281108) was completed on the 30 June 2011 11:22:03 and PASSED the requirements for a valid MOT with 0 comments.

This test (455891281108) was completed on the 30 June 2011 11:22:03 and PASSED the requirements for a valid MOT with 0 comments.

Recorded mileage: 3,815

Recorded mileage: 3,815


MOT TEST: 17 June 2010 09:44:03 PASSED
MOT TEST: 17 June 2010 09:44:03 PASSED

This test (822588360152) was completed on the 17 June 2010 09:44:03 and PASSED the requirements for a valid MOT with 0 comments.

This test (822588360152) was completed on the 17 June 2010 09:44:03 and PASSED the requirements for a valid MOT with 0 comments.

Recorded mileage: 3,552

Recorded mileage: 3,552


MOT TEST: 03 July 2009 12:48:51 PASSED
MOT TEST: 03 July 2009 12:48:51 PASSED

This test (420264189181) was completed on the 03 July 2009 12:48:51 and PASSED the requirements for a valid MOT with 0 comments.

This test (420264189181) was completed on the 03 July 2009 12:48:51 and PASSED the requirements for a valid MOT with 0 comments.

Recorded mileage: 3,327

Recorded mileage: 3,327


MOT TEST: 17 July 2008 15:29:04 PASSED
MOT TEST: 17 July 2008 15:29:04 PASSED

This test (624069598177) was completed on the 17 July 2008 15:29:04 and PASSED the requirements for a valid MOT with 0 comments.

This test (624069598177) was completed on the 17 July 2008 15:29:04 and PASSED the requirements for a valid MOT with 0 comments.

Recorded mileage: 2,943

Recorded mileage: 2,943


MOT TEST: 19 July 2007 10:38:51 FAILED
MOT TEST: 19 July 2007 10:38:51 FAILED

This test (194880607269) was completed on the 19 July 2007 10:38:51 and FAILED the requirements for a valid MOT with 9 comments.

This test (194880607269) was completed on the 19 July 2007 10:38:51 and FAILED the requirements for a valid MOT with 9 comments.

Recorded mileage: 2,891

Recorded mileage: 2,891


FAIL


MOT TEST: 24 July 2006 10:33:34 PASSED
MOT TEST: 24 July 2006 10:33:34 PASSED

This test (843275206276) was completed on the 24 July 2006 10:33:34 and PASSED the requirements for a valid MOT with 0 comments.

This test (843275206276) was completed on the 24 July 2006 10:33:34 and PASSED the requirements for a valid MOT with 0 comments.

Recorded mileage: 2,536

Recorded mileage: 2,536


MOT TEST: 02 August 2005 10:06:05 PASSED
MOT TEST: 02 August 2005 10:06:05 PASSED

This test (370394615224) was completed on the 02 August 2005 10:06:05 and PASSED the requirements for a valid MOT with 0 comments.

This test (370394615224) was completed on the 02 August 2005 10:06:05 and PASSED the requirements for a valid MOT with 0 comments.

Recorded mileage: 1,695

Recorded mileage: 1,695