JKY 864F


JKY864F is registered to a White 1968, Morris Oxford with a Petrol engine. It Failed its most recent MOT Test on the 01 June 2017

11 unique faults (11 Total) reported in its MOT History (6 Tests).

0 common/recurring faults.

83% (5) MOT Pass Rate and a 17% (1) MOT Failure Rate.

65,014 recorded miles.

JKY 864F


JKY864F is registered to a White 1968, Morris Oxford with a Petrol engine. It Failed its most recent MOT Test on the 01 June 2017

11 unique faults (11 Total) reported in its MOT History (6 Tests).

0 common/recurring faults.

83% (5) MOT Pass Rate and a 17% (1) MOT Failure Rate.

65,014 recorded miles.

MOT PASS/Failure rate for JKY 864F

all MOT test results for JKY 864F represented as a percentage
MOT PASS/Failure rate for JKY 864F
all MOT test results for JKY 864F represented as a percentage

PERCENTAGE OF VEHICLE FAULTS WITH JKY 864F

ALL REPORTED FAULTS, DISPLAYED BY PERCENTAGE OF OCCURRENCE DURING ALL MOT TESTS
PERCENTAGE OF VEHICLE FAULTS WITH JKY 864F
ALL REPORTED FAULTS, DISPLAYED BY PERCENTAGE OF OCCURRENCE DURING ALL MOT TESTS
FAIL

JKY 864F annual Faults by type

ALL REPORTED FAULTS, DISPLAYED over time and categorised by type
JKY 864F annual Faults by type
ALL REPORTED FAULTS, DISPLAYED over time and categorised by type

ALL JKY 864F Failure Faults [11]

ALL Failure faults, ORDERED by OCCURRENCE DURING JKY 864F's MOT HISTORY
ALL JKY 864F Failure Faults [11]
ALL Failure faults, ORDERED by OCCURRENCE DURING JKY 864F's MOT HISTORY
Fail Faults | source www.vehiclestats.co.uk
Fault Fault Test Date Test Date/Time Reference MOT Test Reference
1 Nearside windscreen wiper not operating automatically when switched on (8.2.1b) Nearside windscreen wiper not operating automatically when switched on (8.2.1b) 22 March 2013 [12:40] 22/03/2013 747791983018 747791983018
1 Offside windscreen wiper not operating automatically when switched on (8.2.1b) Offside windscreen wiper not operating automatically when switched on (8.2.1b) 22 March 2013 [12:40] 22/03/2013 747791983018 747791983018
1 Direction indicators not working (1.4.a.2c) Direction indicators not working (1.4.a.2c) 22 March 2013 [12:40] 22/03/2013 747791983018 747791983018
1 Nearside seat belt anchorage prescribed area is excessively corroded (5.2.6) Nearside seat belt anchorage prescribed area is excessively corroded (5.2.6) 22 March 2013 [12:40] 22/03/2013 747791983018 747791983018
1 Nearside rear brake recording little or no effort (3.7.b.5a) Nearside rear brake recording little or no effort (3.7.b.5a) 22 March 2013 [12:40] 22/03/2013 747791983018 747791983018
1 Offside rear brake recording little or no effort (3.7.b.5a) Offside rear brake recording little or no effort (3.7.b.5a) 22 March 2013 [12:40] 22/03/2013 747791983018 747791983018
1 Nearside rear parking brake recording little or no effort (3.7.b.6a) Nearside rear parking brake recording little or no effort (3.7.b.6a) 22 March 2013 [12:40] 22/03/2013 747791983018 747791983018
1 Offside rear parking brake recording little or no effort (3.7.b.6a) Offside rear parking brake recording little or no effort (3.7.b.6a) 22 March 2013 [12:40] 22/03/2013 747791983018 747791983018
1 Service brake: efficiency below requirements (3.7.b.7) Service brake: efficiency below requirements (3.7.b.7) 22 March 2013 [12:40] 22/03/2013 747791983018 747791983018
1 Parking brake: efficiency below requirements (3.7.b.7) Parking brake: efficiency below requirements (3.7.b.7) 22 March 2013 [12:40] 22/03/2013 747791983018 747791983018
1 Brakes imbalanced across an axle (3.7.b.5b) Brakes imbalanced across an axle (3.7.b.5b) 22 March 2013 [12:40] 22/03/2013 747791983018 747791983018

MOT TEST: 01 June 2017 11:30:36 PASSED
MOT TEST: 01 June 2017 11:30:36 PASSED

This test (553853397831) was completed on the 01 June 2017 11:30:36 and PASSED the requirements for a valid MOT with 0 comments.

This test (553853397831) was completed on the 01 June 2017 11:30:36 and PASSED the requirements for a valid MOT with 0 comments.

Recorded mileage: 65,014

Recorded mileage: 65,014


MOT TEST: 04 June 2016 10:13:51 PASSED
MOT TEST: 04 June 2016 10:13:51 PASSED

This test (249867524539) was completed on the 04 June 2016 10:13:51 and PASSED the requirements for a valid MOT with 0 comments.

This test (249867524539) was completed on the 04 June 2016 10:13:51 and PASSED the requirements for a valid MOT with 0 comments.

Recorded mileage: 64,835

Recorded mileage: 64,835


MOT TEST: 20 March 2015 16:16:22 PASSED
MOT TEST: 20 March 2015 16:16:22 PASSED

This test (188709775028) was completed on the 20 March 2015 16:16:22 and PASSED the requirements for a valid MOT with 0 comments.

This test (188709775028) was completed on the 20 March 2015 16:16:22 and PASSED the requirements for a valid MOT with 0 comments.

Recorded mileage: 64,828

Recorded mileage: 64,828


MOT TEST: 21 March 2014 13:28:07 PASSED
MOT TEST: 21 March 2014 13:28:07 PASSED

This test (108270484019) was completed on the 21 March 2014 13:28:07 and PASSED the requirements for a valid MOT with 0 comments.

This test (108270484019) was completed on the 21 March 2014 13:28:07 and PASSED the requirements for a valid MOT with 0 comments.

Recorded mileage: 64,552

Recorded mileage: 64,552


MOT TEST: 23 March 2013 11:11:53 PASSED
MOT TEST: 23 March 2013 11:11:53 PASSED

This test (176242083096) was completed on the 23 March 2013 11:11:53 and PASSED the requirements for a valid MOT with 0 comments.

This test (176242083096) was completed on the 23 March 2013 11:11:53 and PASSED the requirements for a valid MOT with 0 comments.

Recorded mileage: 62,695

Recorded mileage: 62,695


MOT TEST: 22 March 2013 12:40:23 FAILED
MOT TEST: 22 March 2013 12:40:23 FAILED

This test (747791983018) was completed on the 22 March 2013 12:40:23 and FAILED the requirements for a valid MOT with 11 comments.

This test (747791983018) was completed on the 22 March 2013 12:40:23 and FAILED the requirements for a valid MOT with 11 comments.

Recorded mileage: 62,695

Recorded mileage: 62,695


FAIL