JLH 340K


JLH340K is registered to a Blue 1971, Morris with a Petrol engine. It Failed its most recent MOT Test on the 25 October 2016

23 unique faults (30 Total) reported in its MOT History (13 Tests).

6 common/recurring faults, the most frequent (3 times) is: Parking brake: efficiency below requirements (3.7.B.7).

54% (7) MOT Pass Rate and a 46% (6) MOT Failure Rate.

31,120 recorded miles.

JLH 340K


JLH340K is registered to a Blue 1971, Morris with a Petrol engine. It Failed its most recent MOT Test on the 25 October 2016

23 unique faults (30 Total) reported in its MOT History (13 Tests).

6 common/recurring faults, the most frequent (3 times) is: Parking brake: efficiency below requirements (3.7.B.7).

54% (7) MOT Pass Rate and a 46% (6) MOT Failure Rate.

31,120 recorded miles.

MOT PASS/Failure rate for JLH 340K

all MOT test results for JLH 340K represented as a percentage
MOT PASS/Failure rate for JLH 340K
all MOT test results for JLH 340K represented as a percentage

PERCENTAGE OF VEHICLE FAULTS WITH JLH 340K

ALL REPORTED FAULTS, DISPLAYED BY PERCENTAGE OF OCCURRENCE DURING ALL MOT TESTS
PERCENTAGE OF VEHICLE FAULTS WITH JLH 340K
ALL REPORTED FAULTS, DISPLAYED BY PERCENTAGE OF OCCURRENCE DURING ALL MOT TESTS
ADVISORY

FAIL

USER ENTERED

JLH 340K annual Faults by type

ALL REPORTED FAULTS, DISPLAYED over time and categorised by type
JLH 340K annual Faults by type
ALL REPORTED FAULTS, DISPLAYED over time and categorised by type

RECURRING FAULTS WITH JLH 340K

FAULTS THAT HAVE OCCURED MORE THAN ONCE DURING JLH 340K's MOT HISTORY
RECURRING FAULTS WITH JLH 340K
FAULTS THAT HAVE OCCURED MORE THAN ONCE DURING JLH 340K's MOT HISTORY
Fault Fault Test Date Test Date/Time Reference MOT Test Reference
3 Parking brake: efficiency below requirements (3.7.b.7) Parking brake: efficiency below requirements (3.7.b.7) 06 October 2016 [08:21] 06/10/2016 21 November 2013 [16:53] 21/11/2013 08 June 2012 [17:23] 08/06/2012 985369793304 985369793304 916915523324 916915523324 657330262121 657330262121
2 Coolant leak Coolant leak 26 November 2013 [16:25] 26/11/2013 21 November 2013 [16:53] 21/11/2013 255890633302 255890633302 916915523324 916915523324
2 Offside rear brake grabbing slightly (3.7.a.5b) Offside rear brake grabbing slightly (3.7.a.5b) 26 March 2010 [10:10] 26/03/2010 22 March 2010 [10:24] 22/03/2010 641085380096 641085380096 392271380069 392271380069
2 Offside rear trailing arm has slight play in a ball joint (2.4.g.2) Offside rear trailing arm has slight play in a ball joint (2.4.g.2) 26 March 2010 [10:10] 26/03/2010 22 March 2010 [10:24] 22/03/2010 641085380096 641085380096 392271380069 392271380069
2 Offside front tyre worn close to the legal limit (4.1.e.1) Offside front tyre worn close to the legal limit (4.1.e.1) 26 March 2010 [10:10] 26/03/2010 22 March 2010 [10:24] 22/03/2010 641085380096 641085380096 392271380069 392271380069
2 All tyres perished All tyres perished 26 March 2010 [10:10] 26/03/2010 22 March 2010 [10:24] 22/03/2010 641085380096 641085380096 392271380069 392271380069

ALL JLH 340K ADVISORIES [9]

ALL ADVISORIES, ORDERED by OCCURRENCE DURING JLH 340K's MOT HISTORY
ALL JLH 340K ADVISORIES [9]
ALL ADVISORIES, ORDERED by OCCURRENCE DURING JLH 340K's MOT HISTORY
Advisory Faults | source www.vehiclestats.co.uk
Fault Fault Test Date Test Date/Time Reference MOT Test Reference
2 Offside rear brake grabbing slightly (3.7.a.5b) Offside rear brake grabbing slightly (3.7.a.5b) 26 March 2010 [10:10] 26/03/2010 22 March 2010 [10:24] 22/03/2010 641085380096 641085380096 392271380069 392271380069
2 Offside rear trailing arm has slight play in a ball joint (2.4.g.2) Offside rear trailing arm has slight play in a ball joint (2.4.g.2) 26 March 2010 [10:10] 26/03/2010 22 March 2010 [10:24] 22/03/2010 641085380096 641085380096 392271380069 392271380069
2 Offside front tyre worn close to the legal limit (4.1.e.1) Offside front tyre worn close to the legal limit (4.1.e.1) 26 March 2010 [10:10] 26/03/2010 22 March 2010 [10:24] 22/03/2010 641085380096 641085380096 392271380069 392271380069
1 Offside front axle swivel joint has slight play (2.5.a.3b) Offside front axle swivel joint has slight play (2.5.a.3b) 09 March 2011 [10:18] 09/03/2011 346088061026 346088061026
1 Service brake: service brake efficiency only just met. It would appear that the braking system requires adjustment or repair. (3.7.b.7) Service brake: service brake efficiency only just met. It would appear that the braking system requires adjustment or repair. (3.7.b.7) 22 March 2010 [10:24] 22/03/2010 392271380069 392271380069
1 Parking brake: parking brake efficiency only just met. It would appear that the braking system requires adjustment or repair. (3.7.b.7) Parking brake: parking brake efficiency only just met. It would appear that the braking system requires adjustment or repair. (3.7.b.7) 22 March 2010 [10:24] 22/03/2010 392271380069 392271380069

ALL JLH 340K Failure Faults [17]

ALL Failure faults, ORDERED by OCCURRENCE DURING JLH 340K's MOT HISTORY
ALL JLH 340K Failure Faults [17]
ALL Failure faults, ORDERED by OCCURRENCE DURING JLH 340K's MOT HISTORY
Fail Faults | source www.vehiclestats.co.uk
Fault Fault Test Date Test Date/Time Reference MOT Test Reference
3 Parking brake: efficiency below requirements (3.7.b.7) Parking brake: efficiency below requirements (3.7.b.7) 06 October 2016 [08:21] 06/10/2016 21 November 2013 [16:53] 21/11/2013 08 June 2012 [17:23] 08/06/2012 985369793304 985369793304 916915523324 916915523324 657330262121 657330262121
1 Brakes imbalanced across an axle (3.7.b.5b) Brakes imbalanced across an axle (3.7.b.5b) 06 October 2016 [08:21] 06/10/2016 985369793304 985369793304
1 Offside front steering rack gaiter split (2.2.d.2d) Offside front steering rack gaiter split (2.2.d.2d) 06 October 2016 [08:21] 06/10/2016 985369793304 985369793304
1 Front suspension component mounting prescribed area is inadequately repaired chassis x 2 (2.4.a.3) Front suspension component mounting prescribed area is inadequately repaired chassis x 2 (2.4.a.3) 06 October 2016 [08:21] 06/10/2016 985369793304 985369793304
1 Nearside front brake binding (3.7.b.1) Nearside front brake binding (3.7.b.1) 07 May 2015 [09:57] 07/05/2015 207307925184 207307925184
1 Offside front brake binding (3.7.b.1) Offside front brake binding (3.7.b.1) 07 May 2015 [09:57] 07/05/2015 207307925184 207307925184
1 Indicator tell tale inoperative (1.4.a.2a) Indicator tell tale inoperative (1.4.a.2a) 08 June 2012 [17:23] 08/06/2012 657330262121 657330262121
1 Nearside front steering rack gaiter split (2.2.d.2d) Nearside front steering rack gaiter split (2.2.d.2d) 09 March 2011 [10:18] 09/03/2011 346088061026 346088061026
1 Windscreen washer provides insufficient washer liquid (8.2.3) Windscreen washer provides insufficient washer liquid (8.2.3) 22 March 2010 [10:24] 22/03/2010 392271380069 392271380069
1 Nearside headlamp not working on main beam (1.7.5a) Nearside headlamp not working on main beam (1.7.5a) 22 March 2010 [10:24] 22/03/2010 392271380069 392271380069
1 Offside headlamp not working on main beam (1.7.5a) Offside headlamp not working on main beam (1.7.5a) 22 March 2010 [10:24] 22/03/2010 392271380069 392271380069
1 Offside headlamp insecure (1.7.3) Offside headlamp insecure (1.7.3) 22 March 2010 [10:24] 22/03/2010 392271380069 392271380069
1 Nearside rear brake binding (3.7.b.1) Nearside rear brake binding (3.7.b.1) 22 March 2010 [10:24] 22/03/2010 392271380069 392271380069
1 Nearside rear tyre has ply or cords exposed (4.1.d.1b) Nearside rear tyre has ply or cords exposed (4.1.d.1b) 22 March 2010 [10:24] 22/03/2010 392271380069 392271380069
1 Nearside rear parking brake recording little or no effort (3.7.b.6a) Nearside rear parking brake recording little or no effort (3.7.b.6a) 22 March 2010 [10:24] 22/03/2010 392271380069 392271380069

ALL JLH 340K User Entered Faults [4]

ALL User Entered faults, ORDERED by OCCURRENCE DURING JLH 340K's MOT HISTORY
ALL JLH 340K User Entered Faults [4]
ALL User Entered faults, ORDERED by OCCURRENCE DURING JLH 340K's MOT HISTORY
User Entered Faults | source www.vehiclestats.co.uk
Fault Fault Test Date Test Date/Time Reference MOT Test Reference
2 Coolant leak Coolant leak 26 November 2013 [16:25] 26/11/2013 21 November 2013 [16:53] 21/11/2013 255890633302 255890633302 916915523324 916915523324
2 All tyres perished All tyres perished 26 March 2010 [10:10] 26/03/2010 22 March 2010 [10:24] 22/03/2010 641085380096 641085380096 392271380069 392271380069

MOT TEST: 25 October 2016 12:25:26 PASSED
MOT TEST: 25 October 2016 12:25:26 PASSED

This test (622534884815) was completed on the 25 October 2016 12:25:26 and PASSED the requirements for a valid MOT with 0 comments.

This test (622534884815) was completed on the 25 October 2016 12:25:26 and PASSED the requirements for a valid MOT with 0 comments.

Recorded mileage: 31,120

Recorded mileage: 31,120


MOT TEST: 06 October 2016 08:21:27 FAILED
MOT TEST: 06 October 2016 08:21:27 FAILED

This test (985369793304) was completed on the 06 October 2016 08:21:27 and FAILED the requirements for a valid MOT with 4 comments.

This test (985369793304) was completed on the 06 October 2016 08:21:27 and FAILED the requirements for a valid MOT with 4 comments.

Recorded mileage: 31,120

Recorded mileage: 31,120


FAIL


MOT TEST: 11 May 2015 07:32:52 PASSED
MOT TEST: 11 May 2015 07:32:52 PASSED

This test (616361935105) was completed on the 11 May 2015 07:32:52 and PASSED the requirements for a valid MOT with 0 comments.

This test (616361935105) was completed on the 11 May 2015 07:32:52 and PASSED the requirements for a valid MOT with 0 comments.

Recorded mileage: 31,056

Recorded mileage: 31,056


MOT TEST: 07 May 2015 09:57:38 FAILED
MOT TEST: 07 May 2015 09:57:38 FAILED

This test (207307925184) was completed on the 07 May 2015 09:57:38 and FAILED the requirements for a valid MOT with 2 comments.

This test (207307925184) was completed on the 07 May 2015 09:57:38 and FAILED the requirements for a valid MOT with 2 comments.

Recorded mileage: 31,055

Recorded mileage: 31,055


FAIL


MOT TEST: 26 November 2013 16:25:40 PASSED
MOT TEST: 26 November 2013 16:25:40 PASSED

This test (255890633302) was completed on the 26 November 2013 16:25:40 and PASSED the requirements for a valid MOT with 1 comments.

This test (255890633302) was completed on the 26 November 2013 16:25:40 and PASSED the requirements for a valid MOT with 1 comments.

Recorded mileage: 30,327

Recorded mileage: 30,327


USER ENTERED


MOT TEST: 21 November 2013 16:53:06 FAILED
MOT TEST: 21 November 2013 16:53:06 FAILED

This test (916915523324) was completed on the 21 November 2013 16:53:06 and FAILED the requirements for a valid MOT with 2 comments.

This test (916915523324) was completed on the 21 November 2013 16:53:06 and FAILED the requirements for a valid MOT with 2 comments.

Recorded mileage: 30,327

Recorded mileage: 30,327


FAIL

USER ENTERED


MOT TEST: 12 June 2012 10:26:53 PASSED
MOT TEST: 12 June 2012 10:26:53 PASSED

This test (359124962102) was completed on the 12 June 2012 10:26:53 and PASSED the requirements for a valid MOT with 0 comments.

This test (359124962102) was completed on the 12 June 2012 10:26:53 and PASSED the requirements for a valid MOT with 0 comments.

Recorded mileage: 30,316

Recorded mileage: 30,316


MOT TEST: 08 June 2012 17:23:09 FAILED
MOT TEST: 08 June 2012 17:23:09 FAILED

This test (657330262121) was completed on the 08 June 2012 17:23:09 and FAILED the requirements for a valid MOT with 2 comments.

This test (657330262121) was completed on the 08 June 2012 17:23:09 and FAILED the requirements for a valid MOT with 2 comments.

Recorded mileage: 30,314

Recorded mileage: 30,314


FAIL


MOT TEST: 09 March 2011 16:44:29 PASSED
MOT TEST: 09 March 2011 16:44:29 PASSED

This test (267188561028) was completed on the 09 March 2011 16:44:29 and PASSED the requirements for a valid MOT with 0 comments.

This test (267188561028) was completed on the 09 March 2011 16:44:29 and PASSED the requirements for a valid MOT with 0 comments.

Recorded mileage: 29,256

Recorded mileage: 29,256


MOT TEST: 09 March 2011 10:18:55 FAILED
MOT TEST: 09 March 2011 10:18:55 FAILED

This test (346088061026) was completed on the 09 March 2011 10:18:55 and FAILED the requirements for a valid MOT with 2 comments.

This test (346088061026) was completed on the 09 March 2011 10:18:55 and FAILED the requirements for a valid MOT with 2 comments.

Recorded mileage: 29,256

Recorded mileage: 29,256


ADVISORY

FAIL


MOT TEST: 26 March 2010 10:10:53 PASSED
MOT TEST: 26 March 2010 10:10:53 PASSED

This test (641085380096) was completed on the 26 March 2010 10:10:53 and PASSED the requirements for a valid MOT with 4 comments.

This test (641085380096) was completed on the 26 March 2010 10:10:53 and PASSED the requirements for a valid MOT with 4 comments.

Recorded mileage: 26,808

Recorded mileage: 26,808


ADVISORY

USER ENTERED


MOT TEST: 22 March 2010 10:24:03 FAILED
MOT TEST: 22 March 2010 10:24:03 FAILED

This test (392271380069) was completed on the 22 March 2010 10:24:03 and FAILED the requirements for a valid MOT with 13 comments.

This test (392271380069) was completed on the 22 March 2010 10:24:03 and FAILED the requirements for a valid MOT with 13 comments.

Recorded mileage: 26,808

Recorded mileage: 26,808


ADVISORY

FAIL

USER ENTERED


MOT TEST: 27 July 2005 12:55:04 PASSED
MOT TEST: 27 July 2005 12:55:04 PASSED

This test (364108405221) was completed on the 27 July 2005 12:55:04 and PASSED the requirements for a valid MOT with 0 comments.

This test (364108405221) was completed on the 27 July 2005 12:55:04 and PASSED the requirements for a valid MOT with 0 comments.

Recorded mileage: 26,695

Recorded mileage: 26,695