JLJ 413E


JLJ413E is registered to a Black 1967, Morris Minor with a Petrol engine. It Failed its most recent MOT Test on the 16 January 2017

26 unique faults (27 Total) reported in its MOT History (11 Tests).

1 common/recurring faults.

73% (8) MOT Pass Rate and a 27% (3) MOT Failure Rate.

18,988 recorded miles.

JLJ 413E


JLJ413E is registered to a Black 1967, Morris Minor with a Petrol engine. It Failed its most recent MOT Test on the 16 January 2017

26 unique faults (27 Total) reported in its MOT History (11 Tests).

1 common/recurring faults.

73% (8) MOT Pass Rate and a 27% (3) MOT Failure Rate.

18,988 recorded miles.

MOT PASS/Failure rate for JLJ 413E

all MOT test results for JLJ 413E represented as a percentage
MOT PASS/Failure rate for JLJ 413E
all MOT test results for JLJ 413E represented as a percentage

PERCENTAGE OF VEHICLE FAULTS WITH JLJ 413E

ALL REPORTED FAULTS, DISPLAYED BY PERCENTAGE OF OCCURRENCE DURING ALL MOT TESTS
PERCENTAGE OF VEHICLE FAULTS WITH JLJ 413E
ALL REPORTED FAULTS, DISPLAYED BY PERCENTAGE OF OCCURRENCE DURING ALL MOT TESTS
ADVISORY

FAIL

JLJ 413E annual Faults by type

ALL REPORTED FAULTS, DISPLAYED over time and categorised by type
JLJ 413E annual Faults by type
ALL REPORTED FAULTS, DISPLAYED over time and categorised by type

ALL JLJ 413E ADVISORIES [5]

ALL ADVISORIES, ORDERED by OCCURRENCE DURING JLJ 413E's MOT HISTORY
ALL JLJ 413E ADVISORIES [5]
ALL ADVISORIES, ORDERED by OCCURRENCE DURING JLJ 413E's MOT HISTORY
Advisory Faults | source www.vehiclestats.co.uk
Fault Fault Test Date Test Date/Time Reference MOT Test Reference
1 Offside track rod end ball joint dust cover deteriorated, but preventing the ingress of dirt (2.2.c.1c) Offside track rod end ball joint dust cover deteriorated, but preventing the ingress of dirt (2.2.c.1c) 16 January 2017 [08:11] 16/01/2017 265040898208 265040898208
1 Offside front upper axle swivel joint has slight play (2.5.a.3b) Offside front upper axle swivel joint has slight play (2.5.a.3b) 16 January 2017 [08:11] 16/01/2017 265040898208 265040898208
1 Nearside front steering rack gaiter deteriorated (2.2.d.2d) Nearside front steering rack gaiter deteriorated (2.2.d.2d) 16 January 2017 [08:11] 16/01/2017 265040898208 265040898208
1 Offside front front wheel bearing has slight play (2.5.a.3c) Offside front front wheel bearing has slight play (2.5.a.3c) 08 April 2016 [07:01] 08/04/2016 947546469978 947546469978
1 Nearside front front wheel bearing has slight play (2.5.a.3c) Nearside front front wheel bearing has slight play (2.5.a.3c) 28 January 2015 [08:03] 28/01/2015 267438225009 267438225009

ALL JLJ 413E Failure Faults [22]

ALL Failure faults, ORDERED by OCCURRENCE DURING JLJ 413E's MOT HISTORY
ALL JLJ 413E Failure Faults [22]
ALL Failure faults, ORDERED by OCCURRENCE DURING JLJ 413E's MOT HISTORY
Fail Faults | source www.vehiclestats.co.uk
Fault Fault Test Date Test Date/Time Reference MOT Test Reference
2 Offside front brake binding (3.7.b.1) Offside front brake binding (3.7.b.1) 18 September 2009 [10:26] 18/09/2009 04 October 2006 [15:52] 04/10/2006 774321169226 774321169226 523817376231 523817376231
1 Nearside torque/reaction arm ball joint dust cover missing (2.4.g.2) Nearside torque/reaction arm ball joint dust cover missing (2.4.g.2) 01 August 2012 [11:50] 01/08/2012 366394712221 366394712221
1 Offside front torque/reaction arm ball joint dust cover excessively damaged so that it no longer prevents the ingress of dirt (2.4.g.2) Offside front torque/reaction arm ball joint dust cover excessively damaged so that it no longer prevents the ingress of dirt (2.4.g.2) 01 August 2012 [11:50] 01/08/2012 366394712221 366394712221
1 Nearside rear suspension spring mounting prescribed area is excessively corroded (2.4.a.3) Nearside rear suspension spring mounting prescribed area is excessively corroded (2.4.a.3) 01 August 2012 [11:50] 01/08/2012 366394712221 366394712221
1 Registration plate lamp not working (1.1.5c) Registration plate lamp not working (1.1.5c) 18 September 2009 [10:26] 18/09/2009 774321169226 774321169226
1 Indicator tell tale inoperative (1.4.a.2a) Indicator tell tale inoperative (1.4.a.2a) 18 September 2009 [10:26] 18/09/2009 774321169226 774321169226
1 Nearside front seat belt locking mechanism does not secure or release (5.2.5a) Nearside front seat belt locking mechanism does not secure or release (5.2.5a) 18 September 2009 [10:26] 18/09/2009 774321169226 774321169226
1 Front windscreen wiper does not clear the windscreen effectively (8.2.2) Front windscreen wiper does not clear the windscreen effectively (8.2.2) 18 September 2009 [10:26] 18/09/2009 774321169226 774321169226
1 Offside suspension component mounting prescribed area is excessively corroded (2.4.a.3) Offside suspension component mounting prescribed area is excessively corroded (2.4.a.3) 18 September 2009 [10:26] 18/09/2009 774321169226 774321169226
1 Nearside front torsion bar insecure at an end fixing (2.4.e.2) Nearside front torsion bar insecure at an end fixing (2.4.e.2) 18 September 2009 [10:26] 18/09/2009 774321169226 774321169226
1 Offside front torsion bar insecure at an end fixing (2.4.e.2) Offside front torsion bar insecure at an end fixing (2.4.e.2) 18 September 2009 [10:26] 18/09/2009 774321169226 774321169226
1 Offside front front brake application uneven (3.7.b.2) Offside front front brake application uneven (3.7.b.2) 18 September 2009 [10:26] 18/09/2009 774321169226 774321169226
1 Offside front front brakes release unevenly (3.7.b.4) Offside front front brakes release unevenly (3.7.b.4) 18 September 2009 [10:26] 18/09/2009 774321169226 774321169226
1 Brakes imbalanced across an axle (3.7.b.5b) Brakes imbalanced across an axle (3.7.b.5b) 18 September 2009 [10:26] 18/09/2009 774321169226 774321169226
1 Parking brake: efficiency below requirements (3.7.c.1b) Parking brake: efficiency below requirements (3.7.c.1b) 04 October 2006 [15:52] 04/10/2006 523817376231 523817376231
1 Offside front parking brake recording little or no effort (3.7.b.6a) Offside front parking brake recording little or no effort (3.7.b.6a) 04 October 2006 [15:52] 04/10/2006 523817376231 523817376231
1 Direction indicators not working (1.4.a.2c) Direction indicators not working (1.4.a.2c) 04 October 2006 [15:52] 04/10/2006 523817376231 523817376231
1 Hazard warning tell tale not working correctly (1.4.b.1e) Hazard warning tell tale not working correctly (1.4.b.1e) 04 October 2006 [15:52] 04/10/2006 523817376231 523817376231
1 Hazard warning lamps not flashing in phase, with ignition on (1.4.b.1f) Hazard warning lamps not flashing in phase, with ignition on (1.4.b.1f) 04 October 2006 [15:52] 04/10/2006 523817376231 523817376231
1 Hazard warning lamps not flashing in phase, with ignition off (1.4.b.1f) Hazard warning lamps not flashing in phase, with ignition off (1.4.b.1f) 04 October 2006 [15:52] 04/10/2006 523817376231 523817376231
1 Horn not working (1.6.2a) Horn not working (1.6.2a) 04 October 2006 [15:52] 04/10/2006 523817376231 523817376231

MOT TEST: 16 January 2017 08:11:10 PASSED
MOT TEST: 16 January 2017 08:11:10 PASSED

This test (265040898208) was completed on the 16 January 2017 08:11:10 and PASSED the requirements for a valid MOT with 3 comments.

This test (265040898208) was completed on the 16 January 2017 08:11:10 and PASSED the requirements for a valid MOT with 3 comments.

Recorded mileage: 18,988

Recorded mileage: 18,988


ADVISORY


MOT TEST: 08 April 2016 07:01:21 PASSED
MOT TEST: 08 April 2016 07:01:21 PASSED

This test (947546469978) was completed on the 08 April 2016 07:01:21 and PASSED the requirements for a valid MOT with 1 comments.

This test (947546469978) was completed on the 08 April 2016 07:01:21 and PASSED the requirements for a valid MOT with 1 comments.

Recorded mileage: 16,101

Recorded mileage: 16,101


ADVISORY


MOT TEST: 28 January 2015 08:03:50 PASSED
MOT TEST: 28 January 2015 08:03:50 PASSED

This test (267438225009) was completed on the 28 January 2015 08:03:50 and PASSED the requirements for a valid MOT with 1 comments.

This test (267438225009) was completed on the 28 January 2015 08:03:50 and PASSED the requirements for a valid MOT with 1 comments.

Recorded mileage: 10,796

Recorded mileage: 10,796


ADVISORY


MOT TEST: 13 August 2013 13:58:24 PASSED
MOT TEST: 13 August 2013 13:58:24 PASSED

This test (579435823235) was completed on the 13 August 2013 13:58:24 and PASSED the requirements for a valid MOT with 0 comments.

This test (579435823235) was completed on the 13 August 2013 13:58:24 and PASSED the requirements for a valid MOT with 0 comments.

Recorded mileage: 4,414

Recorded mileage: 4,414


MOT TEST: 09 August 2012 09:46:43 PASSED
MOT TEST: 09 August 2012 09:46:43 PASSED

This test (169862222264) was completed on the 09 August 2012 09:46:43 and PASSED the requirements for a valid MOT with 0 comments.

This test (169862222264) was completed on the 09 August 2012 09:46:43 and PASSED the requirements for a valid MOT with 0 comments.

Recorded mileage: 3,608

Recorded mileage: 3,608


MOT TEST: 01 August 2012 11:50:18 FAILED
MOT TEST: 01 August 2012 11:50:18 FAILED

This test (366394712221) was completed on the 01 August 2012 11:50:18 and FAILED the requirements for a valid MOT with 3 comments.

This test (366394712221) was completed on the 01 August 2012 11:50:18 and FAILED the requirements for a valid MOT with 3 comments.

Recorded mileage: 3,574

Recorded mileage: 3,574


FAIL


MOT TEST: 23 August 2011 19:46:39 PASSED
MOT TEST: 23 August 2011 19:46:39 PASSED

This test (945075131207) was completed on the 23 August 2011 19:46:39 and PASSED the requirements for a valid MOT with 0 comments.

This test (945075131207) was completed on the 23 August 2011 19:46:39 and PASSED the requirements for a valid MOT with 0 comments.

Recorded mileage: 3,268

Recorded mileage: 3,268


MOT TEST: 23 September 2009 13:57:16 PASSED
MOT TEST: 23 September 2009 13:57:16 PASSED

This test (483116569281) was completed on the 23 September 2009 13:57:16 and PASSED the requirements for a valid MOT with 0 comments.

This test (483116569281) was completed on the 23 September 2009 13:57:16 and PASSED the requirements for a valid MOT with 0 comments.

Recorded mileage: 3,111

Recorded mileage: 3,111


MOT TEST: 18 September 2009 10:26:24 FAILED
MOT TEST: 18 September 2009 10:26:24 FAILED

This test (774321169226) was completed on the 18 September 2009 10:26:24 and FAILED the requirements for a valid MOT with 11 comments.

This test (774321169226) was completed on the 18 September 2009 10:26:24 and FAILED the requirements for a valid MOT with 11 comments.

Recorded mileage: 3,106

Recorded mileage: 3,106


FAIL


MOT TEST: 06 October 2006 12:13:54 PASSED
MOT TEST: 06 October 2006 12:13:54 PASSED

This test (410879576261) was completed on the 06 October 2006 12:13:54 and PASSED the requirements for a valid MOT with 0 comments.

This test (410879576261) was completed on the 06 October 2006 12:13:54 and PASSED the requirements for a valid MOT with 0 comments.

Recorded mileage: 2,707

Recorded mileage: 2,707


MOT TEST: 04 October 2006 15:52:06 FAILED
MOT TEST: 04 October 2006 15:52:06 FAILED

This test (523817376231) was completed on the 04 October 2006 15:52:06 and FAILED the requirements for a valid MOT with 8 comments.

This test (523817376231) was completed on the 04 October 2006 15:52:06 and FAILED the requirements for a valid MOT with 8 comments.

Recorded mileage: 2,707

Recorded mileage: 2,707


FAIL