JLT 94D


JLT94D is registered to a White 1966, Morris with a Petrol engine. It Failed its most recent MOT Test on the 20 June 2012

43 unique faults (51 Total) reported in its MOT History (14 Tests).

6 common/recurring faults, the most frequent (3 times) is: Brakes imbalanced across an axle (3.7.B.5b).

50% (7) MOT Pass Rate and a 50% (7) MOT Failure Rate.

71,962 recorded miles.

JLT 94D


JLT94D is registered to a White 1966, Morris with a Petrol engine. It Failed its most recent MOT Test on the 20 June 2012

43 unique faults (51 Total) reported in its MOT History (14 Tests).

6 common/recurring faults, the most frequent (3 times) is: Brakes imbalanced across an axle (3.7.B.5b).

50% (7) MOT Pass Rate and a 50% (7) MOT Failure Rate.

71,962 recorded miles.

MOT PASS/Failure rate for JLT 94D

all MOT test results for JLT 94D represented as a percentage
MOT PASS/Failure rate for JLT 94D
all MOT test results for JLT 94D represented as a percentage

PERCENTAGE OF VEHICLE FAULTS WITH JLT 94D

ALL REPORTED FAULTS, DISPLAYED BY PERCENTAGE OF OCCURRENCE DURING ALL MOT TESTS
PERCENTAGE OF VEHICLE FAULTS WITH JLT 94D
ALL REPORTED FAULTS, DISPLAYED BY PERCENTAGE OF OCCURRENCE DURING ALL MOT TESTS
ADVISORY

FAIL

USER ENTERED

PASS WITH RECTIFICATION

JLT 94D annual Faults by type

ALL REPORTED FAULTS, DISPLAYED over time and categorised by type
JLT 94D annual Faults by type
ALL REPORTED FAULTS, DISPLAYED over time and categorised by type

RECURRING FAULTS WITH JLT 94D

FAULTS THAT HAVE OCCURED MORE THAN ONCE DURING JLT 94D's MOT HISTORY
RECURRING FAULTS WITH JLT 94D
FAULTS THAT HAVE OCCURED MORE THAN ONCE DURING JLT 94D's MOT HISTORY
Fault Fault Test Date Test Date/Time Reference MOT Test Reference
3 Brakes imbalanced across an axle (3.7.b.5b) Brakes imbalanced across an axle (3.7.b.5b) 22 June 2010 [11:25] 22/06/2010 10 June 2008 [11:43] 10/06/2008 23 June 2007 [09:37] 23/06/2007 460123270104 460123270104 422872568158 422872568158 913394077119 913394077119
2 Nearside seat belt anchorage prescribed area is excessively corroded (5.2.6) Nearside seat belt anchorage prescribed area is excessively corroded (5.2.6) 22 June 2011 [14:59] 22/06/2011 23 June 2007 [09:37] 23/06/2007 475643671186 475643671186 913394077119 913394077119
2 Nearside front upper suspension arm has slight play in a pin/bush (2.4.g.2) Nearside front upper suspension arm has slight play in a pin/bush (2.4.g.2) 02 July 2010 [17:46] 02/07/2010 22 June 2010 [11:25] 22/06/2010 130113480166 130113480166 460123270104 460123270104
2 Nearside body has slight corrosion (6.1.b.2) Nearside body has slight corrosion (6.1.b.2) 02 July 2010 [17:46] 02/07/2010 22 June 2010 [11:25] 22/06/2010 130113480166 130113480166 460123270104 460123270104
2 Both drivers and passengers doors going rusty at the bottom Both drivers and passengers doors going rusty at the bottom 02 July 2010 [17:46] 02/07/2010 22 June 2010 [11:25] 22/06/2010 130113480166 130113480166 460123270104 460123270104
2 Stop lamp not working (1.2.1b) Stop lamp not working (1.2.1b) 23 June 2007 [09:37] 23/06/2007 12 June 2006 [14:09] 12/06/2006 913394077119 913394077119 812133766171 812133766171

ALL JLT 94D ADVISORIES [8]

ALL ADVISORIES, ORDERED by OCCURRENCE DURING JLT 94D's MOT HISTORY
ALL JLT 94D ADVISORIES [8]
ALL ADVISORIES, ORDERED by OCCURRENCE DURING JLT 94D's MOT HISTORY
Advisory Faults | source www.vehiclestats.co.uk
Fault Fault Test Date Test Date/Time Reference MOT Test Reference
2 Nearside front upper suspension arm has slight play in a pin/bush (2.4.g.2) Nearside front upper suspension arm has slight play in a pin/bush (2.4.g.2) 02 July 2010 [17:46] 02/07/2010 22 June 2010 [11:25] 22/06/2010 130113480166 130113480166 460123270104 460123270104
2 Nearside body has slight corrosion (6.1.b.2) Nearside body has slight corrosion (6.1.b.2) 02 July 2010 [17:46] 02/07/2010 22 June 2010 [11:25] 22/06/2010 130113480166 130113480166 460123270104 460123270104
1 Front exhaust has a minor leak of exhaust gases (7.1.2) Front exhaust has a minor leak of exhaust gases (7.1.2) 18 June 2012 [15:17] 18/06/2012 887770372108 887770372108
1 Offside front tyre worn close to the legal limit (4.1.e.1) Offside front tyre worn close to the legal limit (4.1.e.1) 20 June 2009 [10:14] 20/06/2009 301861879142 301861879142
1 Centre exhaust has a minor leak of exhaust gases (7.1.2) Centre exhaust has a minor leak of exhaust gases (7.1.2) 20 June 2009 [10:14] 20/06/2009 301861879142 301861879142
1 Offside steering rack gaiter deteriorated (2.2.d.2d) Offside steering rack gaiter deteriorated (2.2.d.2d) 12 June 2006 [14:09] 12/06/2006 812133766171 812133766171

ALL JLT 94D Failure Faults [36]

ALL Failure faults, ORDERED by OCCURRENCE DURING JLT 94D's MOT HISTORY
ALL JLT 94D Failure Faults [36]
ALL Failure faults, ORDERED by OCCURRENCE DURING JLT 94D's MOT HISTORY
Fail Faults | source www.vehiclestats.co.uk
Fault Fault Test Date Test Date/Time Reference MOT Test Reference
3 Brakes imbalanced across an axle (3.7.b.5b) Brakes imbalanced across an axle (3.7.b.5b) 22 June 2010 [11:25] 22/06/2010 10 June 2008 [11:43] 10/06/2008 23 June 2007 [09:37] 23/06/2007 460123270104 460123270104 422872568158 422872568158 913394077119 913394077119
2 Nearside seat belt anchorage prescribed area is excessively corroded (5.2.6) Nearside seat belt anchorage prescribed area is excessively corroded (5.2.6) 22 June 2011 [14:59] 22/06/2011 23 June 2007 [09:37] 23/06/2007 475643671186 475643671186 913394077119 913394077119
2 Stop lamp not working (1.2.1b) Stop lamp not working (1.2.1b) 23 June 2007 [09:37] 23/06/2007 12 June 2006 [14:09] 12/06/2006 913394077119 913394077119 812133766171 812133766171
1 Centre exhaust system not adequately supported (7.1.1) Centre exhaust system not adequately supported (7.1.1) 18 June 2012 [15:17] 18/06/2012 887770372108 887770372108
1 Nearside front suspension component mounting prescribed area is excessively corroded (2.4.a.3) Nearside front suspension component mounting prescribed area is excessively corroded (2.4.a.3) 18 June 2012 [15:17] 18/06/2012 887770372108 887770372108
1 Centre seat belt anchorage prescribed area is excessively corroded (5.2.6) Centre seat belt anchorage prescribed area is excessively corroded (5.2.6) 18 June 2012 [15:17] 18/06/2012 887770372108 887770372108
1 Nearside body or chassis has excessive corrosion, seriously affecting its strength within 30cm of the body mountings (6.1.b.2) Nearside body or chassis has excessive corrosion, seriously affecting its strength within 30cm of the body mountings (6.1.b.2) 18 June 2012 [15:17] 18/06/2012 887770372108 887770372108
1 Nearside front headlamp not working on main beam (1.7.5a) Nearside front headlamp not working on main beam (1.7.5a) 22 June 2011 [14:59] 22/06/2011 475643671186 475643671186
1 Offside front headlamp not working on main beam (1.7.5a) Offside front headlamp not working on main beam (1.7.5a) 22 June 2011 [14:59] 22/06/2011 475643671186 475643671186
1 Front windscreen washer provides insufficient washer liquid (8.2.3) Front windscreen washer provides insufficient washer liquid (8.2.3) 22 June 2011 [14:59] 22/06/2011 475643671186 475643671186
1 Offside seat belt anchorage prescribed area is excessively corroded (5.2.6) Offside seat belt anchorage prescribed area is excessively corroded (5.2.6) 22 June 2011 [14:59] 22/06/2011 475643671186 475643671186
1 Front suspension has excessive play in a upper suspension ball joint (2.5.b.1a) Front suspension has excessive play in a upper suspension ball joint (2.5.b.1a) 22 June 2011 [14:59] 22/06/2011 475643671186 475643671186
1 Parking brake lever has no reserve travel (3.1.6b) Parking brake lever has no reserve travel (3.1.6b) 22 June 2010 [11:25] 22/06/2010 460123270104 460123270104
1 Nearside rear tyre tread depth below requirements of 1.6mm (4.1.e.1) Nearside rear tyre tread depth below requirements of 1.6mm (4.1.e.1) 22 June 2010 [11:25] 22/06/2010 460123270104 460123270104
1 Nearside steering rack gaiter split (2.2.d.2d) Nearside steering rack gaiter split (2.2.d.2d) 22 June 2010 [11:25] 22/06/2010 460123270104 460123270104
1 Offside front upper suspension arm has excessive play in a pin/bush (2.4.g.2) Offside front upper suspension arm has excessive play in a pin/bush (2.4.g.2) 22 June 2010 [11:25] 22/06/2010 460123270104 460123270104
1 Offside body or chassis has excessive corrosion, seriously affecting its strength within 30cm of the body mountings (6.1.b.2) Offside body or chassis has excessive corrosion, seriously affecting its strength within 30cm of the body mountings (6.1.b.2) 22 June 2010 [11:25] 22/06/2010 460123270104 460123270104
1 Nearside front headlamp not working on dipped beam (1.7.5a) Nearside front headlamp not working on dipped beam (1.7.5a) 20 June 2009 [10:14] 20/06/2009 301861879142 301861879142
1 Nearside front headlamp aim not tested (1.8.a.1c) Nearside front headlamp aim not tested (1.8.a.1c) 20 June 2009 [10:14] 20/06/2009 301861879142 301861879142
1 Nearside front tyre tread depth below requirements of 1.6mm (4.1.e.1) Nearside front tyre tread depth below requirements of 1.6mm (4.1.e.1) 20 June 2009 [10:14] 20/06/2009 301861879142 301861879142
1 Nearside front front wheel bearing rough when rotated (2.5.a.2) Nearside front front wheel bearing rough when rotated (2.5.a.2) 20 June 2009 [10:14] 20/06/2009 301861879142 301861879142
1 Nearside rear tyre(s) incorrect because different size tyres are fitted on the same axle. (4.1.a.1a) Nearside rear tyre(s) incorrect because different size tyres are fitted on the same axle. (4.1.a.1a) 20 June 2009 [10:14] 20/06/2009 301861879142 301861879142
1 Indicator tell tale inoperative (1.4.a.2a) Indicator tell tale inoperative (1.4.a.2a) 10 June 2008 [11:43] 10/06/2008 422872568158 422872568158
1 Offside steering rack gaiter split (2.2.d.2d) Offside steering rack gaiter split (2.2.d.2d) 10 June 2008 [11:43] 10/06/2008 422872568158 422872568158
1 Nearside rear leaf spring fractured (2.4.b.1a) Nearside rear leaf spring fractured (2.4.b.1a) 10 June 2008 [11:43] 10/06/2008 422872568158 422872568158
1 Offside front suspension component mounting prescribed area is excessively corroded (2.4.a.3) Offside front suspension component mounting prescribed area is excessively corroded (2.4.a.3) 10 June 2008 [11:43] 10/06/2008 422872568158 422872568158
1 Offside front lower suspension arm has excessive play in a pin/bush (2.4.g.2) Offside front lower suspension arm has excessive play in a pin/bush (2.4.g.2) 10 June 2008 [11:43] 10/06/2008 422872568158 422872568158
1 Nearside front lower seat belt anchorage prescribed area is excessively corroded (5.2.6) Nearside front lower seat belt anchorage prescribed area is excessively corroded (5.2.6) 10 June 2008 [11:43] 10/06/2008 422872568158 422872568158
1 Offside front steering rack gaiter split (2.2.d.2d) Offside front steering rack gaiter split (2.2.d.2d) 23 June 2007 [09:37] 23/06/2007 913394077119 913394077119
1 Offside obligatory mirror seriously damaged, affecting the rear view (8.1.2a) Offside obligatory mirror seriously damaged, affecting the rear view (8.1.2a) 23 June 2007 [09:37] 23/06/2007 913394077119 913394077119
1 Front brake application uneven (3.7.b.2) Front brake application uneven (3.7.b.2) 23 June 2007 [09:37] 23/06/2007 913394077119 913394077119

ALL JLT 94D User Entered Faults [6]

ALL User Entered faults, ORDERED by OCCURRENCE DURING JLT 94D's MOT HISTORY
ALL JLT 94D User Entered Faults [6]
ALL User Entered faults, ORDERED by OCCURRENCE DURING JLT 94D's MOT HISTORY
Advisory Faults | source www.vehiclestats.co.uk
Fault Fault Test Date Test Date/Time Reference MOT Test Reference
2 Both drivers and passengers doors going rusty at the bottom Both drivers and passengers doors going rusty at the bottom 02 July 2010 [17:46] 02/07/2010 22 June 2010 [11:25] 22/06/2010 130113480166 130113480166 460123270104 460123270104
1 Fuel cap seal Fuel cap seal 12 June 2006 [14:09] 12/06/2006 812133766171 812133766171
1 All tyres All tyres 12 June 2006 [14:09] 12/06/2006 812133766171 812133766171
1 Brake service Brake service 12 June 2006 [14:09] 12/06/2006 812133766171 812133766171
1 Chassis o/s/f nr eng mount Chassis o/s/f nr eng mount 12 June 2006 [14:09] 12/06/2006 812133766171 812133766171

ALL JLT 94D Pass With Rectification Faults [1]

ALL Pass With Rectification faults, ORDERED by OCCURRENCE DURING JLT 94D's MOT HISTORY
ALL JLT 94D Pass With Rectification Faults [1]
ALL Pass With Rectification faults, ORDERED by OCCURRENCE DURING JLT 94D's MOT HISTORY
Pass With Rectification Faults | source www.vehiclestats.co.uk
Fault Fault Test Date Test Date/Time Reference MOT Test Reference
1 Offside windscreen washer provides insufficient washer liquid (8.2.3) Offside windscreen washer provides insufficient washer liquid (8.2.3) 12 June 2006 [14:09] 12/06/2006 812133766171 812133766171

MOT TEST: 20 June 2012 14:16:02 PASSED
MOT TEST: 20 June 2012 14:16:02 PASSED

This test (546672172134) was completed on the 20 June 2012 14:16:02 and PASSED the requirements for a valid MOT with 0 comments.

This test (546672172134) was completed on the 20 June 2012 14:16:02 and PASSED the requirements for a valid MOT with 0 comments.

Recorded mileage: 71,962

Recorded mileage: 71,962


MOT TEST: 18 June 2012 15:17:34 FAILED
MOT TEST: 18 June 2012 15:17:34 FAILED

This test (887770372108) was completed on the 18 June 2012 15:17:34 and FAILED the requirements for a valid MOT with 5 comments.

This test (887770372108) was completed on the 18 June 2012 15:17:34 and FAILED the requirements for a valid MOT with 5 comments.

Recorded mileage: 71,962

Recorded mileage: 71,962


ADVISORY

FAIL


MOT TEST: 22 July 2011 18:05:41 PASSED
MOT TEST: 22 July 2011 18:05:41 PASSED

This test (679333301256) was completed on the 22 July 2011 18:05:41 and PASSED the requirements for a valid MOT with 0 comments.

This test (679333301256) was completed on the 22 July 2011 18:05:41 and PASSED the requirements for a valid MOT with 0 comments.

Recorded mileage: 65,838

Recorded mileage: 65,838


MOT TEST: 22 June 2011 14:59:58 FAILED
MOT TEST: 22 June 2011 14:59:58 FAILED

This test (475643671186) was completed on the 22 June 2011 14:59:58 and FAILED the requirements for a valid MOT with 7 comments.

This test (475643671186) was completed on the 22 June 2011 14:59:58 and FAILED the requirements for a valid MOT with 7 comments.

Recorded mileage: 65,838

Recorded mileage: 65,838


FAIL


MOT TEST: 02 July 2010 17:46:39 PASSED
MOT TEST: 02 July 2010 17:46:39 PASSED

This test (130113480166) was completed on the 02 July 2010 17:46:39 and PASSED the requirements for a valid MOT with 3 comments.

This test (130113480166) was completed on the 02 July 2010 17:46:39 and PASSED the requirements for a valid MOT with 3 comments.

Recorded mileage: 60,259

Recorded mileage: 60,259


ADVISORY

USER ENTERED


MOT TEST: 22 June 2010 11:25:47 FAILED
MOT TEST: 22 June 2010 11:25:47 FAILED

This test (460123270104) was completed on the 22 June 2010 11:25:47 and FAILED the requirements for a valid MOT with 9 comments.

This test (460123270104) was completed on the 22 June 2010 11:25:47 and FAILED the requirements for a valid MOT with 9 comments.

Recorded mileage: 60,256

Recorded mileage: 60,256


ADVISORY

FAIL

USER ENTERED


MOT TEST: 27 June 2009 09:32:05 PASSED
MOT TEST: 27 June 2009 09:32:05 PASSED

This test (512198479181) was completed on the 27 June 2009 09:32:05 and PASSED the requirements for a valid MOT with 0 comments.

This test (512198479181) was completed on the 27 June 2009 09:32:05 and PASSED the requirements for a valid MOT with 0 comments.

Recorded mileage: 52,733

Recorded mileage: 52,733


MOT TEST: 20 June 2009 10:14:59 FAILED
MOT TEST: 20 June 2009 10:14:59 FAILED

This test (301861879142) was completed on the 20 June 2009 10:14:59 and FAILED the requirements for a valid MOT with 7 comments.

This test (301861879142) was completed on the 20 June 2009 10:14:59 and FAILED the requirements for a valid MOT with 7 comments.

Recorded mileage: 52,593

Recorded mileage: 52,593


ADVISORY

FAIL


MOT TEST: 16 June 2008 17:12:39 PASSED
MOT TEST: 16 June 2008 17:12:39 PASSED

This test (934848868185) was completed on the 16 June 2008 17:12:39 and PASSED the requirements for a valid MOT with 0 comments.

This test (934848868185) was completed on the 16 June 2008 17:12:39 and PASSED the requirements for a valid MOT with 0 comments.

Recorded mileage: 43,025

Recorded mileage: 43,025


MOT TEST: 10 June 2008 11:43:18 FAILED
MOT TEST: 10 June 2008 11:43:18 FAILED

This test (422872568158) was completed on the 10 June 2008 11:43:18 and FAILED the requirements for a valid MOT with 7 comments.

This test (422872568158) was completed on the 10 June 2008 11:43:18 and FAILED the requirements for a valid MOT with 7 comments.

Recorded mileage: 43,025

Recorded mileage: 43,025


FAIL


MOT TEST: 29 June 2007 10:09:43 PASSED
MOT TEST: 29 June 2007 10:09:43 PASSED

This test (332260487142) was completed on the 29 June 2007 10:09:43 and PASSED the requirements for a valid MOT with 0 comments.

This test (332260487142) was completed on the 29 June 2007 10:09:43 and PASSED the requirements for a valid MOT with 0 comments.

Recorded mileage: 33,359

Recorded mileage: 33,359


MOT TEST: 23 June 2007 09:37:25 FAILED
MOT TEST: 23 June 2007 09:37:25 FAILED

This test (913394077119) was completed on the 23 June 2007 09:37:25 and FAILED the requirements for a valid MOT with 6 comments.

This test (913394077119) was completed on the 23 June 2007 09:37:25 and FAILED the requirements for a valid MOT with 6 comments.

Recorded mileage: 33,354

Recorded mileage: 33,354


FAIL


MOT TEST: 13 June 2006 16:38:06 PASSED
MOT TEST: 13 June 2006 16:38:06 PASSED

This test (243464566134) was completed on the 13 June 2006 16:38:06 and PASSED the requirements for a valid MOT with 0 comments.

This test (243464566134) was completed on the 13 June 2006 16:38:06 and PASSED the requirements for a valid MOT with 0 comments.

Recorded mileage: 33,095

Recorded mileage: 33,095


MOT TEST: 12 June 2006 14:09:27 FAILED
MOT TEST: 12 June 2006 14:09:27 FAILED

This test (812133766171) was completed on the 12 June 2006 14:09:27 and FAILED the requirements for a valid MOT with 7 comments.

This test (812133766171) was completed on the 12 June 2006 14:09:27 and FAILED the requirements for a valid MOT with 7 comments.

Recorded mileage: 33,095

Recorded mileage: 33,095


ADVISORY

FAIL

USER ENTERED

PASS WITH RECTIFICATION