JLT 960D


JLT960D is registered to a Red 1966, Morris Minor with a Petrol engine. It Passed its most recent MOT Test on the 08 February 2019

10 unique faults (11 Total) reported in its MOT History (14 Tests).

1 common/recurring faults.

57% (8) MOT Pass Rate and a 43% (6) MOT Failure Rate.

16,317 recorded miles.

JLT 960D


JLT960D is registered to a Red 1966, Morris Minor with a Petrol engine. It Passed its most recent MOT Test on the 08 February 2019

10 unique faults (11 Total) reported in its MOT History (14 Tests).

1 common/recurring faults.

57% (8) MOT Pass Rate and a 43% (6) MOT Failure Rate.

16,317 recorded miles.

MOT PASS/Failure rate for JLT 960D

all MOT test results for JLT 960D represented as a percentage
MOT PASS/Failure rate for JLT 960D
all MOT test results for JLT 960D represented as a percentage

PERCENTAGE OF VEHICLE FAULTS WITH JLT 960D

ALL REPORTED FAULTS, DISPLAYED BY PERCENTAGE OF OCCURRENCE DURING ALL MOT TESTS
PERCENTAGE OF VEHICLE FAULTS WITH JLT 960D
ALL REPORTED FAULTS, DISPLAYED BY PERCENTAGE OF OCCURRENCE DURING ALL MOT TESTS
FAIL

PASS WITH RECTIFICATION

JLT 960D annual Faults by type

ALL REPORTED FAULTS, DISPLAYED over time and categorised by type
JLT 960D annual Faults by type
ALL REPORTED FAULTS, DISPLAYED over time and categorised by type

ALL JLT 960D Failure Faults [5]

ALL Failure faults, ORDERED by OCCURRENCE DURING JLT 960D's MOT HISTORY
ALL JLT 960D Failure Faults [5]
ALL Failure faults, ORDERED by OCCURRENCE DURING JLT 960D's MOT HISTORY
Fail Faults | source www.vehiclestats.co.uk
Fault Fault Test Date Test Date/Time Reference MOT Test Reference
1 Nearside steering rack gaiter missing or no longer prevents the ingress of dirt (2.1.3 (g) (ii)) Nearside steering rack gaiter missing or no longer prevents the ingress of dirt (2.1.3 (g) (ii)) 10 January 2019 [12:09] 10/01/2019 882693103846 882693103846
1 Windscreen washer not working (3.5 (a)) Windscreen washer not working (3.5 (a)) 10 January 2019 [12:09] 10/01/2019 882693103846 882693103846
1 Nearside rear reflector missing (1.5.1a) Nearside rear reflector missing (1.5.1a) 16 November 2017 [16:31] 16/11/2017 810544279587 810544279587
1 Offside rear reflector missing (1.5.1a) Offside rear reflector missing (1.5.1a) 16 November 2017 [16:31] 16/11/2017 810544279587 810544279587
1 Horn not working (1.6.2a) Horn not working (1.6.2a) 16 November 2017 [16:31] 16/11/2017 810544279587 810544279587

ALL JLT 960D Pass With Rectification Faults [6]

ALL Pass With Rectification faults, ORDERED by OCCURRENCE DURING JLT 960D's MOT HISTORY
ALL JLT 960D Pass With Rectification Faults [6]
ALL Pass With Rectification faults, ORDERED by OCCURRENCE DURING JLT 960D's MOT HISTORY
Pass With Rectification Faults | source www.vehiclestats.co.uk
Fault Fault Test Date Test Date/Time Reference MOT Test Reference
1 Fuel cap/sealing device missing (7.2.4a) Fuel cap/sealing device missing (7.2.4a) 16 November 2017 [16:31] 16/11/2017 810544279587 810544279587
1 Offside steering rack gaiter split (2.2.d.2d) Offside steering rack gaiter split (2.2.d.2d) 22 August 2016 [12:10] 22/08/2016 338480626176 338480626176
1 Offside headlamp aim too high and too far to the right. (1.8) Offside headlamp aim too high and too far to the right. (1.8) 15 August 2015 [08:41] 15/08/2015 879081290653 879081290653
1 Horn not working (1.6.2a) Horn not working (1.6.2a) 15 August 2015 [08:41] 15/08/2015 879081290653 879081290653
1 Indicator tell tale inoperative (1.4.a.2a) Indicator tell tale inoperative (1.4.a.2a) 11 May 2013 [11:18] 11/05/2013 637901033172 637901033172
1 Offside rear braking system leaking (3.6.a.1) Offside rear braking system leaking (3.6.a.1) 18 April 2012 [15:37] 18/04/2012 419569302102 419569302102

MOT TEST: 08 February 2019 17:45:31 PASSED
MOT TEST: 08 February 2019 17:45:31 PASSED

This test (235592711902) was completed on the 08 February 2019 17:45:31 and PASSED the requirements for a valid MOT with 0 comments.

This test (235592711902) was completed on the 08 February 2019 17:45:31 and PASSED the requirements for a valid MOT with 0 comments.

Recorded mileage: 16,317

Recorded mileage: 16,317


MOT TEST: 10 January 2019 12:09:28 FAILED
MOT TEST: 10 January 2019 12:09:28 FAILED

This test (882693103846) was completed on the 10 January 2019 12:09:28 and FAILED the requirements for a valid MOT with 2 comments.

This test (882693103846) was completed on the 10 January 2019 12:09:28 and FAILED the requirements for a valid MOT with 2 comments.

Recorded mileage: 16,317

Recorded mileage: 16,317


FAIL


MOT TEST: 17 November 2017 14:27:40 PASSED
MOT TEST: 17 November 2017 14:27:40 PASSED

This test (216390312098) was completed on the 17 November 2017 14:27:40 and PASSED the requirements for a valid MOT with 0 comments.

This test (216390312098) was completed on the 17 November 2017 14:27:40 and PASSED the requirements for a valid MOT with 0 comments.

Recorded mileage: 16,082

Recorded mileage: 16,082


MOT TEST: 16 November 2017 16:31:38 FAILED
MOT TEST: 16 November 2017 16:31:38 FAILED

This test (810544279587) was completed on the 16 November 2017 16:31:38 and FAILED the requirements for a valid MOT with 4 comments.

This test (810544279587) was completed on the 16 November 2017 16:31:38 and FAILED the requirements for a valid MOT with 4 comments.

Recorded mileage: 16,082

Recorded mileage: 16,082


FAIL

PASS WITH RECTIFICATION


MOT TEST: 22 August 2016 12:10:11 PASSED
MOT TEST: 22 August 2016 12:10:11 PASSED

This test (820876757107) was completed on the 22 August 2016 12:10:11 and PASSED the requirements for a valid MOT with 0 comments.

This test (820876757107) was completed on the 22 August 2016 12:10:11 and PASSED the requirements for a valid MOT with 0 comments.

Recorded mileage: 16,032

Recorded mileage: 16,032


MOT TEST: 22 August 2016 12:10:10 FAILED
MOT TEST: 22 August 2016 12:10:10 FAILED

This test (338480626176) was completed on the 22 August 2016 12:10:10 and FAILED the requirements for a valid MOT with 1 comments.

This test (338480626176) was completed on the 22 August 2016 12:10:10 and FAILED the requirements for a valid MOT with 1 comments.

Recorded mileage: 16,032

Recorded mileage: 16,032


PASS WITH RECTIFICATION


MOT TEST: 15 August 2015 08:41:51 PASSED
MOT TEST: 15 August 2015 08:41:51 PASSED

This test (919982822086) was completed on the 15 August 2015 08:41:51 and PASSED the requirements for a valid MOT with 0 comments.

This test (919982822086) was completed on the 15 August 2015 08:41:51 and PASSED the requirements for a valid MOT with 0 comments.

Recorded mileage: 15,688

Recorded mileage: 15,688


MOT TEST: 15 August 2015 08:41:50 FAILED
MOT TEST: 15 August 2015 08:41:50 FAILED

This test (879081290653) was completed on the 15 August 2015 08:41:50 and FAILED the requirements for a valid MOT with 2 comments.

This test (879081290653) was completed on the 15 August 2015 08:41:50 and FAILED the requirements for a valid MOT with 2 comments.

Recorded mileage: 15,688

Recorded mileage: 15,688


PASS WITH RECTIFICATION


MOT TEST: 08 May 2014 15:17:45 PASSED
MOT TEST: 08 May 2014 15:17:45 PASSED

This test (815848424118) was completed on the 08 May 2014 15:17:45 and PASSED the requirements for a valid MOT with 0 comments.

This test (815848424118) was completed on the 08 May 2014 15:17:45 and PASSED the requirements for a valid MOT with 0 comments.

Recorded mileage: 15,491

Recorded mileage: 15,491


MOT TEST: 11 May 2013 11:18:45 PASSED
MOT TEST: 11 May 2013 11:18:45 PASSED

This test (558311733127) was completed on the 11 May 2013 11:18:45 and PASSED the requirements for a valid MOT with 0 comments.

This test (558311733127) was completed on the 11 May 2013 11:18:45 and PASSED the requirements for a valid MOT with 0 comments.

Recorded mileage: 15,431

Recorded mileage: 15,431


MOT TEST: 11 May 2013 11:18:45 FAILED
MOT TEST: 11 May 2013 11:18:45 FAILED

This test (637901033172) was completed on the 11 May 2013 11:18:45 and FAILED the requirements for a valid MOT with 1 comments.

This test (637901033172) was completed on the 11 May 2013 11:18:45 and FAILED the requirements for a valid MOT with 1 comments.

Recorded mileage: 15,431

Recorded mileage: 15,431


PASS WITH RECTIFICATION


MOT TEST: 18 April 2012 15:37:09 PASSED
MOT TEST: 18 April 2012 15:37:09 PASSED

This test (196619602134) was completed on the 18 April 2012 15:37:09 and PASSED the requirements for a valid MOT with 0 comments.

This test (196619602134) was completed on the 18 April 2012 15:37:09 and PASSED the requirements for a valid MOT with 0 comments.

Recorded mileage: 14,997

Recorded mileage: 14,997


MOT TEST: 18 April 2012 15:37:09 FAILED
MOT TEST: 18 April 2012 15:37:09 FAILED

This test (419569302102) was completed on the 18 April 2012 15:37:09 and FAILED the requirements for a valid MOT with 1 comments.

This test (419569302102) was completed on the 18 April 2012 15:37:09 and FAILED the requirements for a valid MOT with 1 comments.

Recorded mileage: 14,997

Recorded mileage: 14,997


PASS WITH RECTIFICATION


MOT TEST: 09 April 2011 13:20:02 PASSED
MOT TEST: 09 April 2011 13:20:02 PASSED

This test (166639991426) was completed on the 09 April 2011 13:20:02 and PASSED the requirements for a valid MOT with 0 comments.

This test (166639991426) was completed on the 09 April 2011 13:20:02 and PASSED the requirements for a valid MOT with 0 comments.

Recorded mileage: 14,347

Recorded mileage: 14,347