JMA6N


JMA6N is registered to a Red 1975, Morris Mini clubman with a Petrol engine. It Passed its most recent MOT Test on the 18 May 2018

5 unique faults (5 Total) reported in its MOT History (6 Tests).

0 common/recurring faults.

83% (5) MOT Pass Rate and a 17% (1) MOT Failure Rate.

97,121 recorded miles.

JMA6N


JMA6N is registered to a Red 1975, Morris Mini clubman with a Petrol engine. It Passed its most recent MOT Test on the 18 May 2018

5 unique faults (5 Total) reported in its MOT History (6 Tests).

0 common/recurring faults.

83% (5) MOT Pass Rate and a 17% (1) MOT Failure Rate.

97,121 recorded miles.

MOT PASS/Failure rate for JMA6N

all MOT test results for JMA6N represented as a percentage
MOT PASS/Failure rate for JMA6N
all MOT test results for JMA6N represented as a percentage

PERCENTAGE OF VEHICLE FAULTS WITH JMA6N

ALL REPORTED FAULTS, DISPLAYED BY PERCENTAGE OF OCCURRENCE DURING ALL MOT TESTS
PERCENTAGE OF VEHICLE FAULTS WITH JMA6N
ALL REPORTED FAULTS, DISPLAYED BY PERCENTAGE OF OCCURRENCE DURING ALL MOT TESTS
ADVISORY

FAIL

JMA6N annual Faults by type

ALL REPORTED FAULTS, DISPLAYED over time and categorised by type
JMA6N annual Faults by type
ALL REPORTED FAULTS, DISPLAYED over time and categorised by type

ALL JMA6N ADVISORIES [2]

ALL ADVISORIES, ORDERED by OCCURRENCE DURING JMA6N's MOT HISTORY
ALL JMA6N ADVISORIES [2]
ALL ADVISORIES, ORDERED by OCCURRENCE DURING JMA6N's MOT HISTORY
Advisory Faults | source www.vehiclestats.co.uk
Fault Fault Test Date Test Date/Time Reference MOT Test Reference
1 Offside front suspension has slight play in a upper suspension ball joint (2.5.b.1a) Offside front suspension has slight play in a upper suspension ball joint (2.5.b.1a) 18 May 2018 [09:20] 18/05/2018 495908958687 495908958687
1 Offside front wheel bearing has slight play (2.5.a.3c) Offside front wheel bearing has slight play (2.5.a.3c) 18 May 2018 [09:20] 18/05/2018 495908958687 495908958687

ALL JMA6N Failure Faults [3]

ALL Failure faults, ORDERED by OCCURRENCE DURING JMA6N's MOT HISTORY
ALL JMA6N Failure Faults [3]
ALL Failure faults, ORDERED by OCCURRENCE DURING JMA6N's MOT HISTORY
Fail Faults | source www.vehiclestats.co.uk
Fault Fault Test Date Test Date/Time Reference MOT Test Reference
1 Rear stop lamp not working (1.2.1b) Rear stop lamp not working (1.2.1b) 30 April 2015 [11:10] 30/04/2015 275850925416 275850925416
1 Service brake: efficiency below requirements (3.7.b.7) Service brake: efficiency below requirements (3.7.b.7) 30 April 2015 [11:10] 30/04/2015 275850925416 275850925416
1 Parking brake: efficiency below requirements (3.7.b.7) Parking brake: efficiency below requirements (3.7.b.7) 30 April 2015 [11:10] 30/04/2015 275850925416 275850925416

MOT TEST: 18 May 2018 09:20:47 PASSED
MOT TEST: 18 May 2018 09:20:47 PASSED

This test (495908958687) was completed on the 18 May 2018 09:20:47 and PASSED the requirements for a valid MOT with 2 comments.

This test (495908958687) was completed on the 18 May 2018 09:20:47 and PASSED the requirements for a valid MOT with 2 comments.

Recorded mileage: 59,999

Recorded mileage: 59,999


ADVISORY


MOT TEST: 26 April 2017 12:49:35 PASSED
MOT TEST: 26 April 2017 12:49:35 PASSED

This test (646782334472) was completed on the 26 April 2017 12:49:35 and PASSED the requirements for a valid MOT with 0 comments.

This test (646782334472) was completed on the 26 April 2017 12:49:35 and PASSED the requirements for a valid MOT with 0 comments.

Recorded mileage: 67,711

Recorded mileage: 67,711


MOT TEST: 27 April 2016 10:14:34 PASSED
MOT TEST: 27 April 2016 10:14:34 PASSED

This test (606896180769) was completed on the 27 April 2016 10:14:34 and PASSED the requirements for a valid MOT with 0 comments.

This test (606896180769) was completed on the 27 April 2016 10:14:34 and PASSED the requirements for a valid MOT with 0 comments.

Recorded mileage: 65,252

Recorded mileage: 65,252


MOT TEST: 01 May 2015 17:10:04 PASSED
MOT TEST: 01 May 2015 17:10:04 PASSED

This test (287341625196) was completed on the 01 May 2015 17:10:04 and PASSED the requirements for a valid MOT with 0 comments.

This test (287341625196) was completed on the 01 May 2015 17:10:04 and PASSED the requirements for a valid MOT with 0 comments.

Recorded mileage: 60,784

Recorded mileage: 60,784


MOT TEST: 30 April 2015 11:10:02 FAILED
MOT TEST: 30 April 2015 11:10:02 FAILED

This test (275850925416) was completed on the 30 April 2015 11:10:02 and FAILED the requirements for a valid MOT with 3 comments.

This test (275850925416) was completed on the 30 April 2015 11:10:02 and FAILED the requirements for a valid MOT with 3 comments.

Recorded mileage: 60,749

Recorded mileage: 60,749


FAIL


MOT TEST: 22 April 2014 13:44:51 PASSED
MOT TEST: 22 April 2014 13:44:51 PASSED

This test (589702314104) was completed on the 22 April 2014 13:44:51 and PASSED the requirements for a valid MOT with 0 comments.

This test (589702314104) was completed on the 22 April 2014 13:44:51 and PASSED the requirements for a valid MOT with 0 comments.

Recorded mileage: 97,121

Recorded mileage: 97,121