JMJ 273G


JMJ273G is registered to a Grey 1968, Morris Minor 1000 with a Petrol engine. It Passed its most recent MOT Test on the 24 May 2018

13 unique faults (17 Total) reported in its MOT History (16 Tests).

4 common/recurring faults, the most frequent (2 times) is: Parking brake: efficiency below requirements (3.7.B.7).

81% (13) MOT Pass Rate and a 19% (3) MOT Failure Rate.

25,181 recorded miles.

JMJ 273G


JMJ273G is registered to a Grey 1968, Morris Minor 1000 with a Petrol engine. It Passed its most recent MOT Test on the 24 May 2018

13 unique faults (17 Total) reported in its MOT History (16 Tests).

4 common/recurring faults, the most frequent (2 times) is: Parking brake: efficiency below requirements (3.7.B.7).

81% (13) MOT Pass Rate and a 19% (3) MOT Failure Rate.

25,181 recorded miles.

MOT PASS/Failure rate for JMJ 273G

all MOT test results for JMJ 273G represented as a percentage
MOT PASS/Failure rate for JMJ 273G
all MOT test results for JMJ 273G represented as a percentage

PERCENTAGE OF VEHICLE FAULTS WITH JMJ 273G

ALL REPORTED FAULTS, DISPLAYED BY PERCENTAGE OF OCCURRENCE DURING ALL MOT TESTS
PERCENTAGE OF VEHICLE FAULTS WITH JMJ 273G
ALL REPORTED FAULTS, DISPLAYED BY PERCENTAGE OF OCCURRENCE DURING ALL MOT TESTS
ADVISORY

FAIL

USER ENTERED

JMJ 273G annual Faults by type

ALL REPORTED FAULTS, DISPLAYED over time and categorised by type
JMJ 273G annual Faults by type
ALL REPORTED FAULTS, DISPLAYED over time and categorised by type

RECURRING FAULTS WITH JMJ 273G

FAULTS THAT HAVE OCCURED MORE THAN ONCE DURING JMJ 273G's MOT HISTORY
RECURRING FAULTS WITH JMJ 273G
FAULTS THAT HAVE OCCURED MORE THAN ONCE DURING JMJ 273G's MOT HISTORY
Fault Fault Test Date Test Date/Time Reference MOT Test Reference
2 Parking brake: efficiency below requirements (3.7.b.7) Parking brake: efficiency below requirements (3.7.b.7) 19 May 2016 [15:23] 19/05/2016 15 May 2012 [09:09] 15/05/2012 456175809959 456175809959 619136632164 619136632164
2 Slight play in nearside top truion Slight play in nearside top truion 23 May 2012 [16:21] 23/05/2012 15 May 2012 [09:09] 15/05/2012 707064142122 707064142122 619136632164 619136632164
2 Offside front brake binding (3.7.b.1) Offside front brake binding (3.7.b.1) 15 May 2012 [09:09] 15/05/2012 12 May 2011 [09:07] 12/05/2011 619136632164 619136632164 278652531120 278652531120
2 Offside front top trunion slight play Offside front top trunion slight play 13 May 2011 [10:14] 13/05/2011 12 May 2011 [09:07] 12/05/2011 816493731138 816493731138 278652531120 278652531120

ALL JMJ 273G ADVISORIES [3]

ALL ADVISORIES, ORDERED by OCCURRENCE DURING JMJ 273G's MOT HISTORY
ALL JMJ 273G ADVISORIES [3]
ALL ADVISORIES, ORDERED by OCCURRENCE DURING JMJ 273G's MOT HISTORY
Advisory Faults | source www.vehiclestats.co.uk
Fault Fault Test Date Test Date/Time Reference MOT Test Reference
1 Offside rear inner suspension component mounting prescribed area is corroded but not considered excessive wheel arch at end of sill (5.3.6 (a) (i)) Offside rear inner suspension component mounting prescribed area is corroded but not considered excessive wheel arch at end of sill (5.3.6 (a) (i)) 24 May 2018 [08:01] 24/05/2018 759190423367 759190423367
1 Front exhaust has a minor leak of exhaust gases (7.1.2) Front exhaust has a minor leak of exhaust gases (7.1.2) 14 May 2008 [09:06] 14/05/2008 463595538121 463595538121
1 Exhaust has part of the system slightly deteriorated (7.1.1a) Exhaust has part of the system slightly deteriorated (7.1.1a) 14 May 2008 [09:06] 14/05/2008 463595538121 463595538121

ALL JMJ 273G Failure Faults [9]

ALL Failure faults, ORDERED by OCCURRENCE DURING JMJ 273G's MOT HISTORY
ALL JMJ 273G Failure Faults [9]
ALL Failure faults, ORDERED by OCCURRENCE DURING JMJ 273G's MOT HISTORY
Fail Faults | source www.vehiclestats.co.uk
Fault Fault Test Date Test Date/Time Reference MOT Test Reference
2 Parking brake: efficiency below requirements (3.7.b.7) Parking brake: efficiency below requirements (3.7.b.7) 19 May 2016 [15:23] 19/05/2016 15 May 2012 [09:09] 15/05/2012 456175809959 456175809959 619136632164 619136632164
2 Offside front brake binding (3.7.b.1) Offside front brake binding (3.7.b.1) 15 May 2012 [09:09] 15/05/2012 12 May 2011 [09:07] 12/05/2011 619136632164 619136632164 278652531120 278652531120
1 Brakes imbalanced across an axle (3.7.b.5b) Brakes imbalanced across an axle (3.7.b.5b) 19 May 2016 [15:23] 19/05/2016 456175809959 456175809959
1 Offside rear brake recording little or no effort (3.7.b.5a) Offside rear brake recording little or no effort (3.7.b.5a) 15 May 2012 [09:09] 15/05/2012 619136632164 619136632164
1 Offside front an item not tested (manual) Offside front an item not tested (manual) 15 May 2012 [09:09] 15/05/2012 619136632164 619136632164
1 Windscreen washer provides insufficient washer liquid (8.2.3) Windscreen washer provides insufficient washer liquid (8.2.3) 12 May 2011 [09:07] 12/05/2011 278652531120 278652531120
1 Headlamp not working on dipped beam (1.7.5a) Headlamp not working on dipped beam (1.7.5a) 12 May 2011 [09:07] 12/05/2011 278652531120 278652531120

ALL JMJ 273G User Entered Faults [5]

ALL User Entered faults, ORDERED by OCCURRENCE DURING JMJ 273G's MOT HISTORY
ALL JMJ 273G User Entered Faults [5]
ALL User Entered faults, ORDERED by OCCURRENCE DURING JMJ 273G's MOT HISTORY
User Entered Faults | source www.vehiclestats.co.uk
Fault Fault Test Date Test Date/Time Reference MOT Test Reference
2 Slight play in nearside top truion Slight play in nearside top truion 23 May 2012 [16:21] 23/05/2012 15 May 2012 [09:09] 15/05/2012 707064142122 707064142122 619136632164 619136632164
2 Offside front top trunion slight play Offside front top trunion slight play 13 May 2011 [10:14] 13/05/2011 12 May 2011 [09:07] 12/05/2011 816493731138 816493731138 278652531120 278652531120
1 Slight play nearside top trunion Slight play nearside top trunion 20 May 2013 [09:38] 20/05/2013 709950443180 709950443180

MOT TEST: 24 May 2018 08:01:45 PASSED
MOT TEST: 24 May 2018 08:01:45 PASSED

This test (759190423367) was completed on the 24 May 2018 08:01:45 and PASSED the requirements for a valid MOT with 1 comments.

This test (759190423367) was completed on the 24 May 2018 08:01:45 and PASSED the requirements for a valid MOT with 1 comments.

Recorded mileage: 25,181

Recorded mileage: 25,181


ADVISORY


MOT TEST: 18 May 2017 07:41:36 PASSED
MOT TEST: 18 May 2017 07:41:36 PASSED

This test (687462848852) was completed on the 18 May 2017 07:41:36 and PASSED the requirements for a valid MOT with 0 comments.

This test (687462848852) was completed on the 18 May 2017 07:41:36 and PASSED the requirements for a valid MOT with 0 comments.

Recorded mileage: 25,105

Recorded mileage: 25,105


MOT TEST: 19 May 2016 15:46:44 PASSED
MOT TEST: 19 May 2016 15:46:44 PASSED

This test (180262432972) was completed on the 19 May 2016 15:46:44 and PASSED the requirements for a valid MOT with 0 comments.

This test (180262432972) was completed on the 19 May 2016 15:46:44 and PASSED the requirements for a valid MOT with 0 comments.

Recorded mileage: 25,045

Recorded mileage: 25,045


MOT TEST: 19 May 2016 15:23:01 FAILED
MOT TEST: 19 May 2016 15:23:01 FAILED

This test (456175809959) was completed on the 19 May 2016 15:23:01 and FAILED the requirements for a valid MOT with 2 comments.

This test (456175809959) was completed on the 19 May 2016 15:23:01 and FAILED the requirements for a valid MOT with 2 comments.

Recorded mileage: 25,045

Recorded mileage: 25,045


FAIL


MOT TEST: 13 May 2015 15:30:13 PASSED
MOT TEST: 13 May 2015 15:30:13 PASSED

This test (875023935147) was completed on the 13 May 2015 15:30:13 and PASSED the requirements for a valid MOT with 0 comments.

This test (875023935147) was completed on the 13 May 2015 15:30:13 and PASSED the requirements for a valid MOT with 0 comments.

Recorded mileage: 24,982

Recorded mileage: 24,982


MOT TEST: 16 May 2014 08:49:06 PASSED
MOT TEST: 16 May 2014 08:49:06 PASSED

This test (915346734109) was completed on the 16 May 2014 08:49:06 and PASSED the requirements for a valid MOT with 0 comments.

This test (915346734109) was completed on the 16 May 2014 08:49:06 and PASSED the requirements for a valid MOT with 0 comments.

Recorded mileage: 24,795

Recorded mileage: 24,795


MOT TEST: 20 May 2013 09:38:32 PASSED
MOT TEST: 20 May 2013 09:38:32 PASSED

This test (709950443180) was completed on the 20 May 2013 09:38:32 and PASSED the requirements for a valid MOT with 1 comments.

This test (709950443180) was completed on the 20 May 2013 09:38:32 and PASSED the requirements for a valid MOT with 1 comments.

Recorded mileage: 24,673

Recorded mileage: 24,673


USER ENTERED


MOT TEST: 23 May 2012 16:21:44 PASSED
MOT TEST: 23 May 2012 16:21:44 PASSED

This test (707064142122) was completed on the 23 May 2012 16:21:44 and PASSED the requirements for a valid MOT with 1 comments.

This test (707064142122) was completed on the 23 May 2012 16:21:44 and PASSED the requirements for a valid MOT with 1 comments.

Recorded mileage: 24,557

Recorded mileage: 24,557


USER ENTERED


MOT TEST: 15 May 2012 09:09:19 FAILED
MOT TEST: 15 May 2012 09:09:19 FAILED

This test (619136632164) was completed on the 15 May 2012 09:09:19 and FAILED the requirements for a valid MOT with 5 comments.

This test (619136632164) was completed on the 15 May 2012 09:09:19 and FAILED the requirements for a valid MOT with 5 comments.

Recorded mileage: 24,544

Recorded mileage: 24,544


FAIL

USER ENTERED


MOT TEST: 13 May 2011 10:14:43 PASSED
MOT TEST: 13 May 2011 10:14:43 PASSED

This test (816493731138) was completed on the 13 May 2011 10:14:43 and PASSED the requirements for a valid MOT with 1 comments.

This test (816493731138) was completed on the 13 May 2011 10:14:43 and PASSED the requirements for a valid MOT with 1 comments.

Recorded mileage: 24,381

Recorded mileage: 24,381


USER ENTERED


MOT TEST: 12 May 2011 09:07:25 FAILED
MOT TEST: 12 May 2011 09:07:25 FAILED

This test (278652531120) was completed on the 12 May 2011 09:07:25 and FAILED the requirements for a valid MOT with 4 comments.

This test (278652531120) was completed on the 12 May 2011 09:07:25 and FAILED the requirements for a valid MOT with 4 comments.

Recorded mileage: 24,373

Recorded mileage: 24,373


FAIL

USER ENTERED


MOT TEST: 14 May 2010 09:08:18 PASSED
MOT TEST: 14 May 2010 09:08:18 PASSED

This test (373074830160) was completed on the 14 May 2010 09:08:18 and PASSED the requirements for a valid MOT with 0 comments.

This test (373074830160) was completed on the 14 May 2010 09:08:18 and PASSED the requirements for a valid MOT with 0 comments.

Recorded mileage: 24,221

Recorded mileage: 24,221


MOT TEST: 26 May 2009 11:28:42 PASSED
MOT TEST: 26 May 2009 11:28:42 PASSED

This test (272396549492) was completed on the 26 May 2009 11:28:42 and PASSED the requirements for a valid MOT with 0 comments.

This test (272396549492) was completed on the 26 May 2009 11:28:42 and PASSED the requirements for a valid MOT with 0 comments.

Recorded mileage: 24,126

Recorded mileage: 24,126


MOT TEST: 14 May 2008 09:06:41 PASSED
MOT TEST: 14 May 2008 09:06:41 PASSED

This test (463595538121) was completed on the 14 May 2008 09:06:41 and PASSED the requirements for a valid MOT with 2 comments.

This test (463595538121) was completed on the 14 May 2008 09:06:41 and PASSED the requirements for a valid MOT with 2 comments.

Recorded mileage: 24,025

Recorded mileage: 24,025


ADVISORY


MOT TEST: 30 May 2007 09:09:01 PASSED
MOT TEST: 30 May 2007 09:09:01 PASSED

This test (881370457100) was completed on the 30 May 2007 09:09:01 and PASSED the requirements for a valid MOT with 0 comments.

This test (881370457100) was completed on the 30 May 2007 09:09:01 and PASSED the requirements for a valid MOT with 0 comments.

Recorded mileage: 23,764

Recorded mileage: 23,764


MOT TEST: 16 May 2006 09:19:28 PASSED
MOT TEST: 16 May 2006 09:19:28 PASSED

This test (220406836115) was completed on the 16 May 2006 09:19:28 and PASSED the requirements for a valid MOT with 0 comments.

This test (220406836115) was completed on the 16 May 2006 09:19:28 and PASSED the requirements for a valid MOT with 0 comments.

Recorded mileage: 23,517

Recorded mileage: 23,517