JMK 670B


JMK670B is registered to a Grey 1964, Morris 1100 with a Petrol engine. It Failed its most recent MOT Test on the 02 September 2013

16 unique faults (16 Total) reported in its MOT History (6 Tests).

0 common/recurring faults.

50% (3) MOT Pass Rate and a 50% (3) MOT Failure Rate.

21,260 recorded miles.

JMK 670B


JMK670B is registered to a Grey 1964, Morris 1100 with a Petrol engine. It Failed its most recent MOT Test on the 02 September 2013

16 unique faults (16 Total) reported in its MOT History (6 Tests).

0 common/recurring faults.

50% (3) MOT Pass Rate and a 50% (3) MOT Failure Rate.

21,260 recorded miles.

MOT PASS/Failure rate for JMK 670B

all MOT test results for JMK 670B represented as a percentage
MOT PASS/Failure rate for JMK 670B
all MOT test results for JMK 670B represented as a percentage

PERCENTAGE OF VEHICLE FAULTS WITH JMK 670B

ALL REPORTED FAULTS, DISPLAYED BY PERCENTAGE OF OCCURRENCE DURING ALL MOT TESTS
PERCENTAGE OF VEHICLE FAULTS WITH JMK 670B
ALL REPORTED FAULTS, DISPLAYED BY PERCENTAGE OF OCCURRENCE DURING ALL MOT TESTS
FAIL

USER ENTERED

JMK 670B annual Faults by type

ALL REPORTED FAULTS, DISPLAYED over time and categorised by type
JMK 670B annual Faults by type
ALL REPORTED FAULTS, DISPLAYED over time and categorised by type

ALL JMK 670B Failure Faults [13]

ALL Failure faults, ORDERED by OCCURRENCE DURING JMK 670B's MOT HISTORY
ALL JMK 670B Failure Faults [13]
ALL Failure faults, ORDERED by OCCURRENCE DURING JMK 670B's MOT HISTORY
Fail Faults | source www.vehiclestats.co.uk
Fault Fault Test Date Test Date/Time Reference MOT Test Reference
1 Windscreen washer provides insufficient washer liquid (8.2.3) Windscreen washer provides insufficient washer liquid (8.2.3) 28 August 2013 [12:26] 28/08/2013 757540743222 757540743222
1 Nearside track rod end ball joint dust cover excessively damaged so that it no longer prevents the ingress of dirt (2.2.c.1c) Nearside track rod end ball joint dust cover excessively damaged so that it no longer prevents the ingress of dirt (2.2.c.1c) 28 August 2013 [12:26] 28/08/2013 757540743222 757540743222
1 Nearside rear passenger door does not latch securely closed (6.2.b.1a) Nearside rear passenger door does not latch securely closed (6.2.b.1a) 28 August 2013 [12:26] 28/08/2013 757540743222 757540743222
1 Nearside front seat belt anchorage prescribed area is excessively corroded (5.2.6) Nearside front seat belt anchorage prescribed area is excessively corroded (5.2.6) 28 August 2013 [12:26] 28/08/2013 757540743222 757540743222
1 Offside front front position lamp(s) not working (1.1.a.3b) Offside front front position lamp(s) not working (1.1.a.3b) 23 April 2010 [12:37] 23/04/2010 740533010140 740533010140
1 Nearside front direction indicators not working (1.4.a.2c) Nearside front direction indicators not working (1.4.a.2c) 23 April 2010 [12:37] 23/04/2010 740533010140 740533010140
1 Nearside indicator tell tale inoperative (1.4.a.2a) Nearside indicator tell tale inoperative (1.4.a.2a) 23 April 2010 [12:37] 23/04/2010 740533010140 740533010140
1 Horn not working (1.6.2a) Horn not working (1.6.2a) 23 April 2010 [12:37] 23/04/2010 740533010140 740533010140
1 Front windscreen wiper not operating automatically when switched on (8.2.1b) Front windscreen wiper not operating automatically when switched on (8.2.1b) 23 April 2010 [12:37] 23/04/2010 740533010140 740533010140
1 Centre exhaust system not adequately supported (7.1.1) Centre exhaust system not adequately supported (7.1.1) 23 April 2010 [12:37] 23/04/2010 740533010140 740533010140
1 Nearside windscreen wiper does not clear the windscreen effectively (8.2.2) Nearside windscreen wiper does not clear the windscreen effectively (8.2.2) 09 July 2008 [15:08] 09/07/2008 784561898170 784561898170
1 Offside windscreen wiper does not clear the windscreen effectively (8.2.2) Offside windscreen wiper does not clear the windscreen effectively (8.2.2) 09 July 2008 [15:08] 09/07/2008 784561898170 784561898170
1 Nearside rear rear parking brake recording little or no effort (3.7.b.6a) Nearside rear rear parking brake recording little or no effort (3.7.b.6a) 09 July 2008 [15:08] 09/07/2008 784561898170 784561898170

ALL JMK 670B User Entered Faults [3]

ALL User Entered faults, ORDERED by OCCURRENCE DURING JMK 670B's MOT HISTORY
ALL JMK 670B User Entered Faults [3]
ALL User Entered faults, ORDERED by OCCURRENCE DURING JMK 670B's MOT HISTORY
Fail Faults | source www.vehiclestats.co.uk
Fault Fault Test Date Test Date/Time Reference MOT Test Reference
1 Front brake ballence poor Front brake ballence poor 28 August 2013 [12:26] 28/08/2013 757540743222 757540743222
1 Corrosion on floor pan and sills Corrosion on floor pan and sills 28 August 2013 [12:26] 28/08/2013 757540743222 757540743222
1 Filler in near side sill Filler in near side sill 28 August 2013 [12:26] 28/08/2013 757540743222 757540743222

MOT TEST: 02 September 2013 17:33:12 PASSED
MOT TEST: 02 September 2013 17:33:12 PASSED

This test (315465943215) was completed on the 02 September 2013 17:33:12 and PASSED the requirements for a valid MOT with 0 comments.

This test (315465943215) was completed on the 02 September 2013 17:33:12 and PASSED the requirements for a valid MOT with 0 comments.

Recorded mileage: 21,260

Recorded mileage: 21,260


MOT TEST: 28 August 2013 12:26:59 FAILED
MOT TEST: 28 August 2013 12:26:59 FAILED

This test (757540743222) was completed on the 28 August 2013 12:26:59 and FAILED the requirements for a valid MOT with 7 comments.

This test (757540743222) was completed on the 28 August 2013 12:26:59 and FAILED the requirements for a valid MOT with 7 comments.

Recorded mileage: 21,258

Recorded mileage: 21,258


FAIL

USER ENTERED


MOT TEST: 27 April 2010 11:28:23 PASSED
MOT TEST: 27 April 2010 11:28:23 PASSED

This test (900007410124) was completed on the 27 April 2010 11:28:23 and PASSED the requirements for a valid MOT with 0 comments.

This test (900007410124) was completed on the 27 April 2010 11:28:23 and PASSED the requirements for a valid MOT with 0 comments.

Recorded mileage: 21,011

Recorded mileage: 21,011


MOT TEST: 23 April 2010 12:37:10 FAILED
MOT TEST: 23 April 2010 12:37:10 FAILED

This test (740533010140) was completed on the 23 April 2010 12:37:10 and FAILED the requirements for a valid MOT with 6 comments.

This test (740533010140) was completed on the 23 April 2010 12:37:10 and FAILED the requirements for a valid MOT with 6 comments.

Recorded mileage: 20,999

Recorded mileage: 20,999


FAIL


MOT TEST: 11 July 2008 11:11:33 PASSED
MOT TEST: 11 July 2008 11:11:33 PASSED

This test (242653298476) was completed on the 11 July 2008 11:11:33 and PASSED the requirements for a valid MOT with 0 comments.

This test (242653298476) was completed on the 11 July 2008 11:11:33 and PASSED the requirements for a valid MOT with 0 comments.

Recorded mileage: 20,898

Recorded mileage: 20,898


MOT TEST: 09 July 2008 15:08:39 FAILED
MOT TEST: 09 July 2008 15:08:39 FAILED

This test (784561898170) was completed on the 09 July 2008 15:08:39 and FAILED the requirements for a valid MOT with 3 comments.

This test (784561898170) was completed on the 09 July 2008 15:08:39 and FAILED the requirements for a valid MOT with 3 comments.

Recorded mileage: 20,898

Recorded mileage: 20,898


FAIL