JNK 481L


JNK481L is registered to a White 1972, Morris Marina 1.3 deluxe with a Petrol engine. It Failed its most recent MOT Test on the 24 May 2007

8 unique faults (10 Total) reported in its MOT History (4 Tests).

0 common/recurring faults.

50% (2) MOT Pass Rate and a 50% (2) MOT Failure Rate.

70,399 recorded miles.

JNK 481L


JNK481L is registered to a White 1972, Morris Marina 1.3 deluxe with a Petrol engine. It Failed its most recent MOT Test on the 24 May 2007

8 unique faults (10 Total) reported in its MOT History (4 Tests).

0 common/recurring faults.

50% (2) MOT Pass Rate and a 50% (2) MOT Failure Rate.

70,399 recorded miles.

MOT PASS/Failure rate for JNK 481L

all MOT test results for JNK 481L represented as a percentage
MOT PASS/Failure rate for JNK 481L
all MOT test results for JNK 481L represented as a percentage

PERCENTAGE OF VEHICLE FAULTS WITH JNK 481L

ALL REPORTED FAULTS, DISPLAYED BY PERCENTAGE OF OCCURRENCE DURING ALL MOT TESTS
PERCENTAGE OF VEHICLE FAULTS WITH JNK 481L
ALL REPORTED FAULTS, DISPLAYED BY PERCENTAGE OF OCCURRENCE DURING ALL MOT TESTS
FAIL

USER ENTERED

JNK 481L annual Faults by type

ALL REPORTED FAULTS, DISPLAYED over time and categorised by type
JNK 481L annual Faults by type
ALL REPORTED FAULTS, DISPLAYED over time and categorised by type

ALL JNK 481L Failure Faults [8]

ALL Failure faults, ORDERED by OCCURRENCE DURING JNK 481L's MOT HISTORY
ALL JNK 481L Failure Faults [8]
ALL Failure faults, ORDERED by OCCURRENCE DURING JNK 481L's MOT HISTORY
Fail Faults | source www.vehiclestats.co.uk
Fault Fault Test Date Test Date/Time Reference MOT Test Reference
1 Horn not working (1.6.2a) Horn not working (1.6.2a) 16 May 2007 [08:53] 16/05/2007 240926137114 240926137114
1 Offside rear direction indicator not working (1.4.a.2c) Offside rear direction indicator not working (1.4.a.2c) 16 May 2007 [08:53] 16/05/2007 240926137114 240926137114
1 Nearside rear rear brake binding (3.7.b.1) Nearside rear rear brake binding (3.7.b.1) 16 May 2007 [08:53] 16/05/2007 240926137114 240926137114
1 Parking brake: efficiency below requirements (3.7.b.7) Parking brake: efficiency below requirements (3.7.b.7) 16 May 2007 [08:53] 16/05/2007 240926137114 240926137114
1 Offside front suspension component mounting prescribed area is excessively corroded (2.4.a.3) Offside front suspension component mounting prescribed area is excessively corroded (2.4.a.3) 11 April 2006 [17:02] 11/04/2006 593551006141 593551006141
1 Front suspension component mounting prescribed area is excessively corroded (2.4.a.3) Front suspension component mounting prescribed area is excessively corroded (2.4.a.3) 11 April 2006 [17:02] 11/04/2006 593551006141 593551006141

ALL JNK 481L User Entered Faults [2]

ALL User Entered faults, ORDERED by OCCURRENCE DURING JNK 481L's MOT HISTORY
ALL JNK 481L User Entered Faults [2]
ALL User Entered faults, ORDERED by OCCURRENCE DURING JNK 481L's MOT HISTORY
Fail Faults | source www.vehiclestats.co.uk
Fault Fault Test Date Test Date/Time Reference MOT Test Reference
1 Passenger floor pan corroded outside prescribed area Passenger floor pan corroded outside prescribed area 11 April 2006 [17:02] 11/04/2006 593551006141 593551006141
1 Drivers door mirror missing Drivers door mirror missing 11 April 2006 [17:02] 11/04/2006 593551006141 593551006141

MOT TEST: 24 May 2007 18:20:58 PASSED
MOT TEST: 24 May 2007 18:20:58 PASSED

This test (804444447182) was completed on the 24 May 2007 18:20:58 and PASSED the requirements for a valid MOT with 0 comments.

This test (804444447182) was completed on the 24 May 2007 18:20:58 and PASSED the requirements for a valid MOT with 0 comments.

Recorded mileage: 70,399

Recorded mileage: 70,399


MOT TEST: 16 May 2007 08:53:39 FAILED
MOT TEST: 16 May 2007 08:53:39 FAILED

This test (240926137114) was completed on the 16 May 2007 08:53:39 and FAILED the requirements for a valid MOT with 4 comments.

This test (240926137114) was completed on the 16 May 2007 08:53:39 and FAILED the requirements for a valid MOT with 4 comments.

Recorded mileage: 70,395

Recorded mileage: 70,395


FAIL


MOT TEST: 28 April 2006 12:54:56 PASSED
MOT TEST: 28 April 2006 12:54:56 PASSED

This test (713418116178) was completed on the 28 April 2006 12:54:56 and PASSED the requirements for a valid MOT with 0 comments.

This test (713418116178) was completed on the 28 April 2006 12:54:56 and PASSED the requirements for a valid MOT with 0 comments.

Recorded mileage: 68,497

Recorded mileage: 68,497


MOT TEST: 11 April 2006 17:02:18 FAILED
MOT TEST: 11 April 2006 17:02:18 FAILED

This test (593551006141) was completed on the 11 April 2006 17:02:18 and FAILED the requirements for a valid MOT with 6 comments.

This test (593551006141) was completed on the 11 April 2006 17:02:18 and FAILED the requirements for a valid MOT with 6 comments.

Recorded mileage: 68,497

Recorded mileage: 68,497


FAIL

USER ENTERED