JOC 653


JOC653 is registered to a Green 1948, Morris with a Petrol engine. It Failed its most recent MOT Test on the 13 July 2012

20 unique faults (24 Total) reported in its MOT History (5 Tests).

3 common/recurring faults, the most frequent (2 times) is: Steering system has slight free play detected at steering wheel (2.2.A.1a).

40% (2) MOT Pass Rate and a 60% (3) MOT Failure Rate.

54,873 recorded miles.

JOC 653


JOC653 is registered to a Green 1948, Morris with a Petrol engine. It Failed its most recent MOT Test on the 13 July 2012

20 unique faults (24 Total) reported in its MOT History (5 Tests).

3 common/recurring faults, the most frequent (2 times) is: Steering system has slight free play detected at steering wheel (2.2.A.1a).

40% (2) MOT Pass Rate and a 60% (3) MOT Failure Rate.

54,873 recorded miles.

MOT PASS/Failure rate for JOC 653

all MOT test results for JOC 653 represented as a percentage
MOT PASS/Failure rate for JOC 653
all MOT test results for JOC 653 represented as a percentage

PERCENTAGE OF VEHICLE FAULTS WITH JOC 653

ALL REPORTED FAULTS, DISPLAYED BY PERCENTAGE OF OCCURRENCE DURING ALL MOT TESTS
PERCENTAGE OF VEHICLE FAULTS WITH JOC 653
ALL REPORTED FAULTS, DISPLAYED BY PERCENTAGE OF OCCURRENCE DURING ALL MOT TESTS
ADVISORY

FAIL

JOC 653 annual Faults by type

ALL REPORTED FAULTS, DISPLAYED over time and categorised by type
JOC 653 annual Faults by type
ALL REPORTED FAULTS, DISPLAYED over time and categorised by type

RECURRING FAULTS WITH JOC 653

FAULTS THAT HAVE OCCURED MORE THAN ONCE DURING JOC 653's MOT HISTORY
RECURRING FAULTS WITH JOC 653
FAULTS THAT HAVE OCCURED MORE THAN ONCE DURING JOC 653's MOT HISTORY
Fault Fault Test Date Test Date/Time Reference MOT Test Reference
2 Steering system has slight free play detected at steering wheel (2.2.a.1a) Steering system has slight free play detected at steering wheel (2.2.a.1a) 13 July 2012 [16:19] 13/07/2012 06 June 2012 [15:44] 06/06/2012 466775192139 466775192139 389848852171 389848852171
2 Nearside front suspension component mounting prescribed area is excessively corroded (2.4.a.3) Nearside front suspension component mounting prescribed area is excessively corroded (2.4.a.3) 06 June 2012 [15:44] 06/06/2012 11 May 2011 [14:14] 11/05/2011 389848852171 389848852171 408921331188 408921331188
2 Nearside rear stop lamp not working (1.2.1b) Nearside rear stop lamp not working (1.2.1b) 06 June 2012 [15:44] 06/06/2012 11 May 2011 [14:14] 11/05/2011 389848852171 389848852171 408921331188 408921331188

ALL JOC 653 ADVISORIES [6]

ALL ADVISORIES, ORDERED by OCCURRENCE DURING JOC 653's MOT HISTORY
ALL JOC 653 ADVISORIES [6]
ALL ADVISORIES, ORDERED by OCCURRENCE DURING JOC 653's MOT HISTORY
Advisory Faults | source www.vehiclestats.co.uk
Fault Fault Test Date Test Date/Time Reference MOT Test Reference
2 Steering system has slight free play detected at steering wheel (2.2.a.1a) Steering system has slight free play detected at steering wheel (2.2.a.1a) 13 July 2012 [16:19] 13/07/2012 06 June 2012 [15:44] 06/06/2012 466775192139 466775192139 389848852171 389848852171
1 Offside front brake hose slightly deteriorated (3.6.b.4d) Offside front brake hose slightly deteriorated (3.6.b.4d) 13 June 2006 [09:37] 13/06/2006 313114666104 313114666104
1 Nearside front axle king pin has slight play in pin and/or bush (2.5.a.3a) Nearside front axle king pin has slight play in pin and/or bush (2.5.a.3a) 13 June 2006 [09:37] 13/06/2006 313114666104 313114666104
1 Offside front axle king pin has slight play in pin and/or bush (2.5.a.3a) Offside front axle king pin has slight play in pin and/or bush (2.5.a.3a) 13 June 2006 [09:37] 13/06/2006 313114666104 313114666104
1 Steering system slightly tight (2.2.d.1) Steering system slightly tight (2.2.d.1) 13 June 2006 [09:37] 13/06/2006 313114666104 313114666104

ALL JOC 653 Failure Faults [18]

ALL Failure faults, ORDERED by OCCURRENCE DURING JOC 653's MOT HISTORY
ALL JOC 653 Failure Faults [18]
ALL Failure faults, ORDERED by OCCURRENCE DURING JOC 653's MOT HISTORY
Fail Faults | source www.vehiclestats.co.uk
Fault Fault Test Date Test Date/Time Reference MOT Test Reference
2 Nearside front suspension component mounting prescribed area is excessively corroded (2.4.a.3) Nearside front suspension component mounting prescribed area is excessively corroded (2.4.a.3) 06 June 2012 [15:44] 06/06/2012 11 May 2011 [14:14] 11/05/2011 389848852171 389848852171 408921331188 408921331188
2 Nearside rear stop lamp not working (1.2.1b) Nearside rear stop lamp not working (1.2.1b) 06 June 2012 [15:44] 06/06/2012 11 May 2011 [14:14] 11/05/2011 389848852171 389848852171 408921331188 408921331188
1 Offside front suspension component mounting prescribed area is excessively corroded (2.4.a.3) Offside front suspension component mounting prescribed area is excessively corroded (2.4.a.3) 06 June 2012 [15:44] 06/06/2012 389848852171 389848852171
1 Nearside rear position lamp(s) not working (1.1.a.3b) Nearside rear position lamp(s) not working (1.1.a.3b) 06 June 2012 [15:44] 06/06/2012 389848852171 389848852171
1 Service brake is causing the vehicle to swerve to the nearside (3.7.c.2) Service brake is causing the vehicle to swerve to the nearside (3.7.c.2) 06 June 2012 [15:44] 06/06/2012 389848852171 389848852171
1 Service brake: efficiency below requirements (3.7.c.1a) Service brake: efficiency below requirements (3.7.c.1a) 06 June 2012 [15:44] 06/06/2012 389848852171 389848852171
1 Nearside front headlamp aim too low (1.8) Nearside front headlamp aim too low (1.8) 11 May 2011 [14:14] 11/05/2011 408921331188 408921331188
1 Offside front headlamp aim too low (1.8) Offside front headlamp aim too low (1.8) 11 May 2011 [14:14] 11/05/2011 408921331188 408921331188
1 Nearside front leaf spring has excessive wear in a shackle pin and/or bush (2.4.b.2) Nearside front leaf spring has excessive wear in a shackle pin and/or bush (2.4.b.2) 11 May 2011 [14:14] 11/05/2011 408921331188 408921331188
1 Fuel cap/sealing device sealing washer missing (7.2.4c) Fuel cap/sealing device sealing washer missing (7.2.4c) 11 May 2011 [14:14] 11/05/2011 408921331188 408921331188
1 Offside rear suspension component mounting prescribed area is excessively corroded (2.4.a.3) Offside rear suspension component mounting prescribed area is excessively corroded (2.4.a.3) 11 May 2011 [14:14] 11/05/2011 408921331188 408921331188
1 Offside front tyre has a cut in excess of the requirements deep enough to reach the ply or cords (4.1.d.1a) Offside front tyre has a cut in excess of the requirements deep enough to reach the ply or cords (4.1.d.1a) 13 June 2006 [09:37] 13/06/2006 313114666104 313114666104
1 Nearside front tyre has a cut in excess of the requirements deep enough to reach the ply or cords (4.1.d.1a) Nearside front tyre has a cut in excess of the requirements deep enough to reach the ply or cords (4.1.d.1a) 13 June 2006 [09:37] 13/06/2006 313114666104 313114666104
1 Offside rear tyre has a cut in excess of the requirements deep enough to reach the ply or cords (4.1.d.1a) Offside rear tyre has a cut in excess of the requirements deep enough to reach the ply or cords (4.1.d.1a) 13 June 2006 [09:37] 13/06/2006 313114666104 313114666104
1 Offside rear suspension spring mounting prescribed area is excessively corroded (2.4.a.3) Offside rear suspension spring mounting prescribed area is excessively corroded (2.4.a.3) 13 June 2006 [09:37] 13/06/2006 313114666104 313114666104

MOT TEST: 13 July 2012 16:19:19 PASSED
MOT TEST: 13 July 2012 16:19:19 PASSED

This test (466775192139) was completed on the 13 July 2012 16:19:19 and PASSED the requirements for a valid MOT with 1 comments.

This test (466775192139) was completed on the 13 July 2012 16:19:19 and PASSED the requirements for a valid MOT with 1 comments.

Recorded mileage: 54,873

Recorded mileage: 54,873


ADVISORY


MOT TEST: 06 June 2012 15:44:15 FAILED
MOT TEST: 06 June 2012 15:44:15 FAILED

This test (389848852171) was completed on the 06 June 2012 15:44:15 and FAILED the requirements for a valid MOT with 7 comments.

This test (389848852171) was completed on the 06 June 2012 15:44:15 and FAILED the requirements for a valid MOT with 7 comments.

Recorded mileage: 54,870

Recorded mileage: 54,870


ADVISORY

FAIL


MOT TEST: 24 May 2011 16:11:53 PASSED
MOT TEST: 24 May 2011 16:11:53 PASSED

This test (236004641189) was completed on the 24 May 2011 16:11:53 and PASSED the requirements for a valid MOT with 0 comments.

This test (236004641189) was completed on the 24 May 2011 16:11:53 and PASSED the requirements for a valid MOT with 0 comments.

Recorded mileage: 54,759

Recorded mileage: 54,759


MOT TEST: 11 May 2011 14:14:28 FAILED
MOT TEST: 11 May 2011 14:14:28 FAILED

This test (408921331188) was completed on the 11 May 2011 14:14:28 and FAILED the requirements for a valid MOT with 7 comments.

This test (408921331188) was completed on the 11 May 2011 14:14:28 and FAILED the requirements for a valid MOT with 7 comments.

Recorded mileage: 54,752

Recorded mileage: 54,752


FAIL


MOT TEST: 13 June 2006 09:37:50 FAILED
MOT TEST: 13 June 2006 09:37:50 FAILED

This test (313114666104) was completed on the 13 June 2006 09:37:50 and FAILED the requirements for a valid MOT with 9 comments.

This test (313114666104) was completed on the 13 June 2006 09:37:50 and FAILED the requirements for a valid MOT with 9 comments.

Recorded mileage: 54,741

Recorded mileage: 54,741


ADVISORY

FAIL