JOD 376E


JOD376E is registered to a Grey 1967, Morris Minor 1000 with a Petrol engine. It Passed its most recent MOT Test on the 15 May 2018

23 unique faults (26 Total) reported in its MOT History (10 Tests).

3 common/recurring faults, the most frequent (2 times) is: Nearside Front Road wheel with a slightly distorted bead rim (4.2.A.1a).

70% (7) MOT Pass Rate and a 30% (3) MOT Failure Rate.

58,769 recorded miles.

JOD 376E


JOD376E is registered to a Grey 1967, Morris Minor 1000 with a Petrol engine. It Passed its most recent MOT Test on the 15 May 2018

23 unique faults (26 Total) reported in its MOT History (10 Tests).

3 common/recurring faults, the most frequent (2 times) is: Nearside Front Road wheel with a slightly distorted bead rim (4.2.A.1a).

70% (7) MOT Pass Rate and a 30% (3) MOT Failure Rate.

58,769 recorded miles.

MOT PASS/Failure rate for JOD 376E

all MOT test results for JOD 376E represented as a percentage
MOT PASS/Failure rate for JOD 376E
all MOT test results for JOD 376E represented as a percentage

PERCENTAGE OF VEHICLE FAULTS WITH JOD 376E

ALL REPORTED FAULTS, DISPLAYED BY PERCENTAGE OF OCCURRENCE DURING ALL MOT TESTS
PERCENTAGE OF VEHICLE FAULTS WITH JOD 376E
ALL REPORTED FAULTS, DISPLAYED BY PERCENTAGE OF OCCURRENCE DURING ALL MOT TESTS
ADVISORY

FAIL

USER ENTERED

PASS WITH RECTIFICATION

JOD 376E annual Faults by type

ALL REPORTED FAULTS, DISPLAYED over time and categorised by type
JOD 376E annual Faults by type
ALL REPORTED FAULTS, DISPLAYED over time and categorised by type

RECURRING FAULTS WITH JOD 376E

FAULTS THAT HAVE OCCURED MORE THAN ONCE DURING JOD 376E's MOT HISTORY
RECURRING FAULTS WITH JOD 376E
FAULTS THAT HAVE OCCURED MORE THAN ONCE DURING JOD 376E's MOT HISTORY
Fault Fault Test Date Test Date/Time Reference MOT Test Reference
2 Nearside front road wheel with a slightly distorted bead rim (4.2.a.1a) Nearside front road wheel with a slightly distorted bead rim (4.2.a.1a) 12 May 2017 [15:37] 12/05/2017 08 May 2017 [14:46] 08/05/2017 411348747128 411348747128 816154276983 816154276983
2 Nearside rear hub seal missing Nearside rear hub seal missing 12 May 2017 [15:37] 12/05/2017 08 May 2017 [14:46] 08/05/2017 411348747128 411348747128 816154276983 816154276983
2 Nearside rear tyre lightly perished Nearside rear tyre lightly perished 12 May 2017 [15:37] 12/05/2017 08 May 2017 [14:46] 08/05/2017 411348747128 411348747128 816154276983 816154276983

ALL JOD 376E ADVISORIES [9]

ALL ADVISORIES, ORDERED by OCCURRENCE DURING JOD 376E's MOT HISTORY
ALL JOD 376E ADVISORIES [9]
ALL ADVISORIES, ORDERED by OCCURRENCE DURING JOD 376E's MOT HISTORY
Advisory Faults | source www.vehiclestats.co.uk
Fault Fault Test Date Test Date/Time Reference MOT Test Reference
2 Nearside front road wheel with a slightly distorted bead rim (4.2.a.1a) Nearside front road wheel with a slightly distorted bead rim (4.2.a.1a) 12 May 2017 [15:37] 12/05/2017 08 May 2017 [14:46] 08/05/2017 411348747128 411348747128 816154276983 816154276983
2 Nearside rear hub seal missing Nearside rear hub seal missing 12 May 2017 [15:37] 12/05/2017 08 May 2017 [14:46] 08/05/2017 411348747128 411348747128 816154276983 816154276983
2 Nearside rear tyre lightly perished Nearside rear tyre lightly perished 12 May 2017 [15:37] 12/05/2017 08 May 2017 [14:46] 08/05/2017 411348747128 411348747128 816154276983 816154276983
1 Nearside rear parking (secondary) brake imbalance requirements only just met. It would appear that the braking system requires adjustment or repair. (3.7.b.6b) Nearside rear parking (secondary) brake imbalance requirements only just met. It would appear that the braking system requires adjustment or repair. (3.7.b.6b) 25 March 2014 [11:29] 25/03/2014 249384084031 249384084031
1 Nearside rear brakes imbalanced requirements only just met. It would appear that the braking system requires adjustment or repair. (3.7.b.5b) Nearside rear brakes imbalanced requirements only just met. It would appear that the braking system requires adjustment or repair. (3.7.b.5b) 25 March 2014 [11:29] 25/03/2014 249384084031 249384084031
1 Offside front front wheel bearing has slight play (2.5.a.3c) Offside front front wheel bearing has slight play (2.5.a.3c) 25 March 2014 [11:29] 25/03/2014 249384084031 249384084031

ALL JOD 376E Failure Faults [15]

ALL Failure faults, ORDERED by OCCURRENCE DURING JOD 376E's MOT HISTORY
ALL JOD 376E Failure Faults [15]
ALL Failure faults, ORDERED by OCCURRENCE DURING JOD 376E's MOT HISTORY
Pass With Rectification Faults | source www.vehiclestats.co.uk
Fault Fault Test Date Test Date/Time Reference MOT Test Reference
1 Horn not working (1.6.2a) Horn not working (1.6.2a) 14 May 2018 [15:24] 14/05/2018 293086820903 293086820903
1 Offside front tyre has a cut in excess of the requirements deep enough to reach the ply or cords badly perished (4.1.d.1a) Offside front tyre has a cut in excess of the requirements deep enough to reach the ply or cords badly perished (4.1.d.1a) 14 May 2018 [15:24] 14/05/2018 293086820903 293086820903
1 Offside rear tyre has a cut in excess of the requirements deep enough to reach the ply or cords (4.1.d.1a) Offside rear tyre has a cut in excess of the requirements deep enough to reach the ply or cords (4.1.d.1a) 14 May 2018 [15:24] 14/05/2018 293086820903 293086820903
1 Bonnet retaining device ineffective catch faulty (8.4.2) Bonnet retaining device ineffective catch faulty (8.4.2) 14 May 2018 [15:24] 14/05/2018 293086820903 293086820903
1 Nearside headlamp not working on main beam (1.7.5a) Nearside headlamp not working on main beam (1.7.5a) 08 May 2017 [14:46] 08/05/2017 816154276983 816154276983
1 Drivers seat fore and aft adjustment mechanism not functioning as intended. (6.2.a.3) Drivers seat fore and aft adjustment mechanism not functioning as intended. (6.2.a.3) 08 May 2017 [14:46] 08/05/2017 816154276983 816154276983
1 Fuel cap/sealing device missing (7.2.4a) Fuel cap/sealing device missing (7.2.4a) 08 May 2017 [14:46] 08/05/2017 816154276983 816154276983
1 Nearside front wheel bearing rough when rotated (2.5.a.2) Nearside front wheel bearing rough when rotated (2.5.a.2) 08 May 2017 [14:46] 08/05/2017 816154276983 816154276983
1 Offside front wheel bearing rough when rotated (2.5.a.2) Offside front wheel bearing rough when rotated (2.5.a.2) 08 May 2017 [14:46] 08/05/2017 816154276983 816154276983
1 Nearside stop lamp not working (1.2.1b) Nearside stop lamp not working (1.2.1b) 26 March 2013 [15:33] 26/03/2013 345675283049 345675283049
1 Offside stop lamp not working (1.2.1b) Offside stop lamp not working (1.2.1b) 26 March 2013 [15:33] 26/03/2013 345675283049 345675283049
1 Nearside headlamp aim too low (1.8) Nearside headlamp aim too low (1.8) 26 March 2013 [15:33] 26/03/2013 345675283049 345675283049
1 Nearside rear rear brake recording little or no effort (3.7.b.5a) Nearside rear rear brake recording little or no effort (3.7.b.5a) 26 March 2013 [15:33] 26/03/2013 345675283049 345675283049
1 Nearside rear rear parking brake recording little or no effort (3.7.b.6a) Nearside rear rear parking brake recording little or no effort (3.7.b.6a) 26 March 2013 [15:33] 26/03/2013 345675283049 345675283049
1 Parking brake: efficiency below requirements (3.7.b.7) Parking brake: efficiency below requirements (3.7.b.7) 26 March 2013 [15:33] 26/03/2013 345675283049 345675283049

ALL JOD 376E User Entered Faults [1]

ALL User Entered faults, ORDERED by OCCURRENCE DURING JOD 376E's MOT HISTORY
ALL JOD 376E User Entered Faults [1]
ALL User Entered faults, ORDERED by OCCURRENCE DURING JOD 376E's MOT HISTORY
Advisory Faults | source www.vehiclestats.co.uk
Fault Fault Test Date Test Date/Time Reference MOT Test Reference
1 Rear near-side tyre cracking on sidewall Rear near-side tyre cracking on sidewall 25 March 2014 [11:29] 25/03/2014 249384084031 249384084031

ALL JOD 376E Pass With Rectification Faults [1]

ALL Pass With Rectification faults, ORDERED by OCCURRENCE DURING JOD 376E's MOT HISTORY
ALL JOD 376E Pass With Rectification Faults [1]
ALL Pass With Rectification faults, ORDERED by OCCURRENCE DURING JOD 376E's MOT HISTORY
Pass With Rectification Faults | source www.vehiclestats.co.uk
Fault Fault Test Date Test Date/Time Reference MOT Test Reference
1 Nearside rear direction indicator not working (1.4.a.2c) Nearside rear direction indicator not working (1.4.a.2c) 14 May 2018 [15:24] 14/05/2018 293086820903 293086820903

MOT TEST: 15 May 2018 14:52:32 PASSED
MOT TEST: 15 May 2018 14:52:32 PASSED

This test (285344746289) was completed on the 15 May 2018 14:52:32 and PASSED the requirements for a valid MOT with 0 comments.

This test (285344746289) was completed on the 15 May 2018 14:52:32 and PASSED the requirements for a valid MOT with 0 comments.

Recorded mileage: 58,769

Recorded mileage: 58,769


MOT TEST: 14 May 2018 15:24:45 FAILED
MOT TEST: 14 May 2018 15:24:45 FAILED

This test (293086820903) was completed on the 14 May 2018 15:24:45 and FAILED the requirements for a valid MOT with 5 comments.

This test (293086820903) was completed on the 14 May 2018 15:24:45 and FAILED the requirements for a valid MOT with 5 comments.

Recorded mileage: 58,769

Recorded mileage: 58,769


FAIL

PASS WITH RECTIFICATION


MOT TEST: 12 May 2017 15:37:45 PASSED
MOT TEST: 12 May 2017 15:37:45 PASSED

This test (411348747128) was completed on the 12 May 2017 15:37:45 and PASSED the requirements for a valid MOT with 3 comments.

This test (411348747128) was completed on the 12 May 2017 15:37:45 and PASSED the requirements for a valid MOT with 3 comments.

Recorded mileage: 57,996

Recorded mileage: 57,996


ADVISORY


MOT TEST: 08 May 2017 14:46:01 FAILED
MOT TEST: 08 May 2017 14:46:01 FAILED

This test (816154276983) was completed on the 08 May 2017 14:46:01 and FAILED the requirements for a valid MOT with 8 comments.

This test (816154276983) was completed on the 08 May 2017 14:46:01 and FAILED the requirements for a valid MOT with 8 comments.

Recorded mileage: 57,996

Recorded mileage: 57,996


ADVISORY

FAIL


MOT TEST: 04 May 2016 13:59:13 PASSED
MOT TEST: 04 May 2016 13:59:13 PASSED

This test (532165164737) was completed on the 04 May 2016 13:59:13 and PASSED the requirements for a valid MOT with 0 comments.

This test (532165164737) was completed on the 04 May 2016 13:59:13 and PASSED the requirements for a valid MOT with 0 comments.

Recorded mileage: 57,498

Recorded mileage: 57,498


MOT TEST: 25 March 2014 11:29:45 PASSED
MOT TEST: 25 March 2014 11:29:45 PASSED

This test (249384084031) was completed on the 25 March 2014 11:29:45 and PASSED the requirements for a valid MOT with 4 comments.

This test (249384084031) was completed on the 25 March 2014 11:29:45 and PASSED the requirements for a valid MOT with 4 comments.

Recorded mileage: 56,860

Recorded mileage: 56,860


ADVISORY

USER ENTERED


MOT TEST: 26 March 2013 16:47:45 PASSED
MOT TEST: 26 March 2013 16:47:45 PASSED

This test (166105183489) was completed on the 26 March 2013 16:47:45 and PASSED the requirements for a valid MOT with 0 comments.

This test (166105183489) was completed on the 26 March 2013 16:47:45 and PASSED the requirements for a valid MOT with 0 comments.

Recorded mileage: 55,975

Recorded mileage: 55,975


MOT TEST: 26 March 2013 15:33:08 FAILED
MOT TEST: 26 March 2013 15:33:08 FAILED

This test (345675283049) was completed on the 26 March 2013 15:33:08 and FAILED the requirements for a valid MOT with 6 comments.

This test (345675283049) was completed on the 26 March 2013 15:33:08 and FAILED the requirements for a valid MOT with 6 comments.

Recorded mileage: 55,974

Recorded mileage: 55,974


FAIL


MOT TEST: 16 March 2012 11:58:11 PASSED
MOT TEST: 16 March 2012 11:58:11 PASSED

This test (849146972053) was completed on the 16 March 2012 11:58:11 and PASSED the requirements for a valid MOT with 0 comments.

This test (849146972053) was completed on the 16 March 2012 11:58:11 and PASSED the requirements for a valid MOT with 0 comments.

Recorded mileage: 54,811

Recorded mileage: 54,811


MOT TEST: 06 April 2011 11:42:03 PASSED
MOT TEST: 06 April 2011 11:42:03 PASSED

This test (267746191001) was completed on the 06 April 2011 11:42:03 and PASSED the requirements for a valid MOT with 0 comments.

This test (267746191001) was completed on the 06 April 2011 11:42:03 and PASSED the requirements for a valid MOT with 0 comments.

Recorded mileage: 54,137

Recorded mileage: 54,137