JOD 606E


JOD606E is registered to a Grey 1967, Morris Minor 1000 with a Petrol engine. It Passed its most recent MOT Test on the 15 October 2018

38 unique faults (42 Total) reported in its MOT History (20 Tests).

3 common/recurring faults, the most frequent (2 times) is: Nearside Stop lamp not working (1.2.1b).

70% (14) MOT Pass Rate and a 30% (6) MOT Failure Rate.

60,758 recorded miles.

JOD 606E


JOD606E is registered to a Grey 1967, Morris Minor 1000 with a Petrol engine. It Passed its most recent MOT Test on the 15 October 2018

38 unique faults (42 Total) reported in its MOT History (20 Tests).

3 common/recurring faults, the most frequent (2 times) is: Nearside Stop lamp not working (1.2.1b).

70% (14) MOT Pass Rate and a 30% (6) MOT Failure Rate.

60,758 recorded miles.

MOT PASS/Failure rate for JOD 606E

all MOT test results for JOD 606E represented as a percentage
MOT PASS/Failure rate for JOD 606E
all MOT test results for JOD 606E represented as a percentage

PERCENTAGE OF VEHICLE FAULTS WITH JOD 606E

ALL REPORTED FAULTS, DISPLAYED BY PERCENTAGE OF OCCURRENCE DURING ALL MOT TESTS
PERCENTAGE OF VEHICLE FAULTS WITH JOD 606E
ALL REPORTED FAULTS, DISPLAYED BY PERCENTAGE OF OCCURRENCE DURING ALL MOT TESTS
ADVISORY

FAIL

USER ENTERED

JOD 606E annual Faults by type

ALL REPORTED FAULTS, DISPLAYED over time and categorised by type
JOD 606E annual Faults by type
ALL REPORTED FAULTS, DISPLAYED over time and categorised by type

RECURRING FAULTS WITH JOD 606E

FAULTS THAT HAVE OCCURED MORE THAN ONCE DURING JOD 606E's MOT HISTORY
RECURRING FAULTS WITH JOD 606E
FAULTS THAT HAVE OCCURED MORE THAN ONCE DURING JOD 606E's MOT HISTORY
Fault Fault Test Date Test Date/Time Reference MOT Test Reference
2 Nearside stop lamp not working (1.2.1b) Nearside stop lamp not working (1.2.1b) 17 July 2013 [16:08] 17/07/2013 15 July 2010 [13:20] 15/07/2010 475658893199 475658893199 464936890108 464936890108
2 Offside stop lamp not working (1.2.1b) Offside stop lamp not working (1.2.1b) 17 July 2013 [16:08] 17/07/2013 15 July 2010 [13:20] 15/07/2010 475658893199 475658893199 464936890108 464936890108
2 Offside rear suspension component mounting prescribed area is excessively corroded (2.4.a.3) Offside rear suspension component mounting prescribed area is excessively corroded (2.4.a.3) 13 July 2011 [08:52] 13/07/2011 15 July 2010 [13:20] 15/07/2010 206624991142 206624991142 464936890108 464936890108

ALL JOD 606E ADVISORIES [3]

ALL ADVISORIES, ORDERED by OCCURRENCE DURING JOD 606E's MOT HISTORY
ALL JOD 606E ADVISORIES [3]
ALL ADVISORIES, ORDERED by OCCURRENCE DURING JOD 606E's MOT HISTORY
Advisory Faults | source www.vehiclestats.co.uk
Fault Fault Test Date Test Date/Time Reference MOT Test Reference
1 Exhaust has a minor leak of exhaust gases (7.1.2) Exhaust has a minor leak of exhaust gases (7.1.2) 23 July 2008 [08:55] 23/07/2008 624035008266 624035008266
1 Nearside rear tyre worn close to the legal limit (4.1.e.1) Nearside rear tyre worn close to the legal limit (4.1.e.1) 23 July 2008 [08:55] 23/07/2008 624035008266 624035008266
1 Offside rear shock absorber has a light misting of oil (2.7.3) Offside rear shock absorber has a light misting of oil (2.7.3) 23 July 2008 [08:55] 23/07/2008 624035008266 624035008266

ALL JOD 606E Failure Faults [31]

ALL Failure faults, ORDERED by OCCURRENCE DURING JOD 606E's MOT HISTORY
ALL JOD 606E Failure Faults [31]
ALL Failure faults, ORDERED by OCCURRENCE DURING JOD 606E's MOT HISTORY
Fail Faults | source www.vehiclestats.co.uk
Fault Fault Test Date Test Date/Time Reference MOT Test Reference
2 Nearside stop lamp not working (1.2.1b) Nearside stop lamp not working (1.2.1b) 17 July 2013 [16:08] 17/07/2013 15 July 2010 [13:20] 15/07/2010 475658893199 475658893199 464936890108 464936890108
2 Offside stop lamp not working (1.2.1b) Offside stop lamp not working (1.2.1b) 17 July 2013 [16:08] 17/07/2013 15 July 2010 [13:20] 15/07/2010 475658893199 475658893199 464936890108 464936890108
2 Offside rear suspension component mounting prescribed area is excessively corroded (2.4.a.3) Offside rear suspension component mounting prescribed area is excessively corroded (2.4.a.3) 13 July 2011 [08:52] 13/07/2011 15 July 2010 [13:20] 15/07/2010 206624991142 206624991142 464936890108 464936890108
1 Offside headlamp not working on dipped beam (4.1.1 (a) (ii)) Offside headlamp not working on dipped beam (4.1.1 (a) (ii)) 11 October 2018 [08:59] 11/10/2018 530101021317 530101021317
1 Offside rear parking brake inoperative on one side (1.4.1 (a)) Offside rear parking brake inoperative on one side (1.4.1 (a)) 11 October 2018 [08:59] 11/10/2018 530101021317 530101021317
1 Parking brake efficiency below requirements (1.4.2 (a) (i)) Parking brake efficiency below requirements (1.4.2 (a) (i)) 11 October 2018 [08:59] 11/10/2018 530101021317 530101021317
1 Offside front vehicle structure has excessive corrosion, seriously affecting its strength within 30cm of the body mountings outer sill (6.1.b.2) Offside front vehicle structure has excessive corrosion, seriously affecting its strength within 30cm of the body mountings outer sill (6.1.b.2) 09 October 2017 [15:02] 09/10/2017 596877969491 596877969491
1 Front brakes imbalanced across an axle (3.7.b.5b) Front brakes imbalanced across an axle (3.7.b.5b) 07 October 2016 [07:47] 07/10/2016 797948533887 797948533887
1 Nearside headlamp not working on dipped beam (1.7.5a) Nearside headlamp not working on dipped beam (1.7.5a) 07 October 2016 [07:47] 07/10/2016 797948533887 797948533887
1 Nearside windscreen wiper does not clear the windscreen effectively (8.2.2) Nearside windscreen wiper does not clear the windscreen effectively (8.2.2) 17 July 2013 [16:08] 17/07/2013 475658893199 475658893199
1 Offside windscreen wiper does not clear the windscreen effectively (8.2.2) Offside windscreen wiper does not clear the windscreen effectively (8.2.2) 17 July 2013 [16:08] 17/07/2013 475658893199 475658893199
1 Offside suspension component mounting prescribed area is excessively corroded (2.4.a.3) Offside suspension component mounting prescribed area is excessively corroded (2.4.a.3) 17 July 2013 [16:08] 17/07/2013 475658893199 475658893199
1 Nearside track rod end ball joint dust cover excessively deteriorated so that it no longer prevents the ingress of dirt (2.2.c.1c) Nearside track rod end ball joint dust cover excessively deteriorated so that it no longer prevents the ingress of dirt (2.2.c.1c) 17 July 2013 [16:08] 17/07/2013 475658893199 475658893199
1 Offside track rod end ball joint dust cover excessively deteriorated so that it no longer prevents the ingress of dirt (2.2.c.1c) Offside track rod end ball joint dust cover excessively deteriorated so that it no longer prevents the ingress of dirt (2.2.c.1c) 17 July 2013 [16:08] 17/07/2013 475658893199 475658893199
1 Nearside direction indicator not working (1.4.a.2c) Nearside direction indicator not working (1.4.a.2c) 17 July 2013 [16:08] 17/07/2013 475658893199 475658893199
1 Offside direction indicator not working (1.4.a.2c) Offside direction indicator not working (1.4.a.2c) 17 July 2013 [16:08] 17/07/2013 475658893199 475658893199
1 Offside rear brake binding (3.7.b.1) Offside rear brake binding (3.7.b.1) 13 July 2011 [08:52] 13/07/2011 206624991142 206624991142
1 Offside front suspension component mounting prescribed area is excessively corroded (2.4.a.3) Offside front suspension component mounting prescribed area is excessively corroded (2.4.a.3) 13 July 2011 [08:52] 13/07/2011 206624991142 206624991142
1 Nearside suspension component mounting prescribed area is excessively corroded (2.4.a.3) Nearside suspension component mounting prescribed area is excessively corroded (2.4.a.3) 13 July 2011 [08:52] 13/07/2011 206624991142 206624991142
1 Parking brake: efficiency below requirements (3.7.c.1b) Parking brake: efficiency below requirements (3.7.c.1b) 13 July 2011 [08:52] 13/07/2011 206624991142 206624991142
1 Windscreen washer provides insufficient washer liquid (8.2.3) Windscreen washer provides insufficient washer liquid (8.2.3) 13 July 2011 [08:52] 13/07/2011 206624991142 206624991142
1 Nearside rear position lamp(s) not working (1.1.a.3b) Nearside rear position lamp(s) not working (1.1.a.3b) 13 July 2011 [08:52] 13/07/2011 206624991142 206624991142
1 Exhaust has a major leak of exhaust gases (7.1.2) Exhaust has a major leak of exhaust gases (7.1.2) 15 July 2010 [13:20] 15/07/2010 464936890108 464936890108
1 Front suspension component mounting prescribed area is excessively corroded (2.4.a.3) Front suspension component mounting prescribed area is excessively corroded (2.4.a.3) 15 July 2010 [13:20] 15/07/2010 464936890108 464936890108
1 Nearside rear suspension component mounting prescribed area is excessively corroded (2.4.a.3) Nearside rear suspension component mounting prescribed area is excessively corroded (2.4.a.3) 15 July 2010 [13:20] 15/07/2010 464936890108 464936890108
1 Offside rear shock absorber has a serious fluid leak (2.7.3) Offside rear shock absorber has a serious fluid leak (2.7.3) 15 July 2010 [13:20] 15/07/2010 464936890108 464936890108
1 Brake pedal has insufficient reserve movement (3.3.a.5) Brake pedal has insufficient reserve movement (3.3.a.5) 15 July 2010 [13:20] 15/07/2010 464936890108 464936890108

ALL JOD 606E User Entered Faults [8]

ALL User Entered faults, ORDERED by OCCURRENCE DURING JOD 606E's MOT HISTORY
ALL JOD 606E User Entered Faults [8]
ALL User Entered faults, ORDERED by OCCURRENCE DURING JOD 606E's MOT HISTORY
User Entered Faults | source www.vehiclestats.co.uk
Fault Fault Test Date Test Date/Time Reference MOT Test Reference
1 Slight imbalance on front brakes Slight imbalance on front brakes 21 July 2015 [08:03] 21/07/2015 765402605245 765402605245
1 Corrosion showing to o/s/r sill Corrosion showing to o/s/r sill 21 July 2015 [08:03] 21/07/2015 765402605245 765402605245
1 Slight play in o/s/f lower trunion assembly Slight play in o/s/f lower trunion assembly 23 July 2012 [17:16] 23/07/2012 957325802296 957325802296
1 Slight imbalance on brakes Slight imbalance on brakes 23 July 2012 [17:16] 23/07/2012 957325802296 957325802296
1 Corrosion showing to o/s floor and front chassis Corrosion showing to o/s floor and front chassis 23 July 2012 [17:16] 23/07/2012 957325802296 957325802296
1 Wiper rubbers in poor condition Wiper rubbers in poor condition 15 July 2009 [17:10] 15/07/2009 783306499175 783306499175
1 Fuel cap seal in poor condition Fuel cap seal in poor condition 15 July 2009 [17:10] 15/07/2009 783306499175 783306499175
1 Vehicle structure has had extensive welding repairs in the past Vehicle structure has had extensive welding repairs in the past 15 July 2009 [17:10] 15/07/2009 783306499175 783306499175

MOT TEST: 15 October 2018 14:57:51 PASSED
MOT TEST: 15 October 2018 14:57:51 PASSED

This test (278267517506) was completed on the 15 October 2018 14:57:51 and PASSED the requirements for a valid MOT with 0 comments.

This test (278267517506) was completed on the 15 October 2018 14:57:51 and PASSED the requirements for a valid MOT with 0 comments.

Recorded mileage: 60,758

Recorded mileage: 60,758


MOT TEST: 11 October 2018 08:59:47 FAILED
MOT TEST: 11 October 2018 08:59:47 FAILED

This test (530101021317) was completed on the 11 October 2018 08:59:47 and FAILED the requirements for a valid MOT with 3 comments.

This test (530101021317) was completed on the 11 October 2018 08:59:47 and FAILED the requirements for a valid MOT with 3 comments.

Recorded mileage: 60,758

Recorded mileage: 60,758


FAIL


MOT TEST: 25 October 2017 16:46:21 PASSED
MOT TEST: 25 October 2017 16:46:21 PASSED

This test (866883607695) was completed on the 25 October 2017 16:46:21 and PASSED the requirements for a valid MOT with 0 comments.

This test (866883607695) was completed on the 25 October 2017 16:46:21 and PASSED the requirements for a valid MOT with 0 comments.

Recorded mileage: 60,595

Recorded mileage: 60,595


MOT TEST: 09 October 2017 15:02:05 FAILED
MOT TEST: 09 October 2017 15:02:05 FAILED

This test (596877969491) was completed on the 09 October 2017 15:02:05 and FAILED the requirements for a valid MOT with 1 comments.

This test (596877969491) was completed on the 09 October 2017 15:02:05 and FAILED the requirements for a valid MOT with 1 comments.

Recorded mileage: 60,590

Recorded mileage: 60,590


FAIL


MOT TEST: 07 October 2016 15:24:58 PASSED
MOT TEST: 07 October 2016 15:24:58 PASSED

This test (939375331061) was completed on the 07 October 2016 15:24:58 and PASSED the requirements for a valid MOT with 0 comments.

This test (939375331061) was completed on the 07 October 2016 15:24:58 and PASSED the requirements for a valid MOT with 0 comments.

Recorded mileage: 60,222

Recorded mileage: 60,222


MOT TEST: 07 October 2016 07:47:44 FAILED
MOT TEST: 07 October 2016 07:47:44 FAILED

This test (797948533887) was completed on the 07 October 2016 07:47:44 and FAILED the requirements for a valid MOT with 2 comments.

This test (797948533887) was completed on the 07 October 2016 07:47:44 and FAILED the requirements for a valid MOT with 2 comments.

Recorded mileage: 60,222

Recorded mileage: 60,222


FAIL


MOT TEST: 20 July 2016 09:55:14 PASSED
MOT TEST: 20 July 2016 09:55:14 PASSED

This test (563207933912) was completed on the 20 July 2016 09:55:14 and PASSED the requirements for a valid MOT with 0 comments.

This test (563207933912) was completed on the 20 July 2016 09:55:14 and PASSED the requirements for a valid MOT with 0 comments.

Recorded mileage: 60,221

Recorded mileage: 60,221


MOT TEST: 21 July 2015 08:03:52 PASSED
MOT TEST: 21 July 2015 08:03:52 PASSED

This test (765402605245) was completed on the 21 July 2015 08:03:52 and PASSED the requirements for a valid MOT with 2 comments.

This test (765402605245) was completed on the 21 July 2015 08:03:52 and PASSED the requirements for a valid MOT with 2 comments.

Recorded mileage: 59,990

Recorded mileage: 59,990


USER ENTERED


MOT TEST: 09 July 2014 10:01:19 PASSED
MOT TEST: 09 July 2014 10:01:19 PASSED

This test (188600994173) was completed on the 09 July 2014 10:01:19 and PASSED the requirements for a valid MOT with 0 comments.

This test (188600994173) was completed on the 09 July 2014 10:01:19 and PASSED the requirements for a valid MOT with 0 comments.

Recorded mileage: 59,708

Recorded mileage: 59,708


MOT TEST: 25 July 2013 12:35:49 PASSED
MOT TEST: 25 July 2013 12:35:49 PASSED

This test (349596903213) was completed on the 25 July 2013 12:35:49 and PASSED the requirements for a valid MOT with 0 comments.

This test (349596903213) was completed on the 25 July 2013 12:35:49 and PASSED the requirements for a valid MOT with 0 comments.

Recorded mileage: 59,384

Recorded mileage: 59,384


MOT TEST: 17 July 2013 16:08:32 FAILED
MOT TEST: 17 July 2013 16:08:32 FAILED

This test (475658893199) was completed on the 17 July 2013 16:08:32 and FAILED the requirements for a valid MOT with 9 comments.

This test (475658893199) was completed on the 17 July 2013 16:08:32 and FAILED the requirements for a valid MOT with 9 comments.

Recorded mileage: 59,384

Recorded mileage: 59,384


FAIL


MOT TEST: 23 July 2012 17:16:54 PASSED
MOT TEST: 23 July 2012 17:16:54 PASSED

This test (957325802296) was completed on the 23 July 2012 17:16:54 and PASSED the requirements for a valid MOT with 3 comments.

This test (957325802296) was completed on the 23 July 2012 17:16:54 and PASSED the requirements for a valid MOT with 3 comments.

Recorded mileage: 59,044

Recorded mileage: 59,044


USER ENTERED


MOT TEST: 04 August 2011 15:26:18 PASSED
MOT TEST: 04 August 2011 15:26:18 PASSED

This test (586356911211) was completed on the 04 August 2011 15:26:18 and PASSED the requirements for a valid MOT with 0 comments.

This test (586356911211) was completed on the 04 August 2011 15:26:18 and PASSED the requirements for a valid MOT with 0 comments.

Recorded mileage: 58,675

Recorded mileage: 58,675


MOT TEST: 13 July 2011 08:52:37 FAILED
MOT TEST: 13 July 2011 08:52:37 FAILED

This test (206624991142) was completed on the 13 July 2011 08:52:37 and FAILED the requirements for a valid MOT with 7 comments.

This test (206624991142) was completed on the 13 July 2011 08:52:37 and FAILED the requirements for a valid MOT with 7 comments.

Recorded mileage: 58,675

Recorded mileage: 58,675


FAIL


MOT TEST: 05 August 2010 08:00:21 PASSED
MOT TEST: 05 August 2010 08:00:21 PASSED

This test (371017410402) was completed on the 05 August 2010 08:00:21 and PASSED the requirements for a valid MOT with 0 comments.

This test (371017410402) was completed on the 05 August 2010 08:00:21 and PASSED the requirements for a valid MOT with 0 comments.

Recorded mileage: 58,176

Recorded mileage: 58,176


MOT TEST: 15 July 2010 13:20:21 FAILED
MOT TEST: 15 July 2010 13:20:21 FAILED

This test (464936890108) was completed on the 15 July 2010 13:20:21 and FAILED the requirements for a valid MOT with 9 comments.

This test (464936890108) was completed on the 15 July 2010 13:20:21 and FAILED the requirements for a valid MOT with 9 comments.

Recorded mileage: 58,127

Recorded mileage: 58,127


FAIL


MOT TEST: 15 July 2009 17:10:12 PASSED
MOT TEST: 15 July 2009 17:10:12 PASSED

This test (783306499175) was completed on the 15 July 2009 17:10:12 and PASSED the requirements for a valid MOT with 3 comments.

This test (783306499175) was completed on the 15 July 2009 17:10:12 and PASSED the requirements for a valid MOT with 3 comments.

Recorded mileage: 57,232

Recorded mileage: 57,232


USER ENTERED


MOT TEST: 23 July 2008 08:55:03 PASSED
MOT TEST: 23 July 2008 08:55:03 PASSED

This test (624035008266) was completed on the 23 July 2008 08:55:03 and PASSED the requirements for a valid MOT with 3 comments.

This test (624035008266) was completed on the 23 July 2008 08:55:03 and PASSED the requirements for a valid MOT with 3 comments.

Recorded mileage: 55,262

Recorded mileage: 55,262


ADVISORY


MOT TEST: 17 July 2007 09:07:36 PASSED
MOT TEST: 17 July 2007 09:07:36 PASSED

This test (391458097130) was completed on the 17 July 2007 09:07:36 and PASSED the requirements for a valid MOT with 0 comments.

This test (391458097130) was completed on the 17 July 2007 09:07:36 and PASSED the requirements for a valid MOT with 0 comments.

Recorded mileage: 54,384

Recorded mileage: 54,384


MOT TEST: 01 August 2006 10:05:19 PASSED
MOT TEST: 01 August 2006 10:05:19 PASSED

This test (181203516210) was completed on the 01 August 2006 10:05:19 and PASSED the requirements for a valid MOT with 0 comments.

This test (181203516210) was completed on the 01 August 2006 10:05:19 and PASSED the requirements for a valid MOT with 0 comments.

Recorded mileage: 53,430

Recorded mileage: 53,430