JOD 969E


JOD969E is registered to a Grey 1967, Morris Minor 1000 with a Petrol engine. It Passed its most recent MOT Test on the 04 July 2018

36 unique faults (42 Total) reported in its MOT History (22 Tests).

6 common/recurring faults, the most frequent (2 times) is: Nearside Front Lower suspension swivel slight play.

59% (13) MOT Pass Rate and a 41% (9) MOT Failure Rate.

50,924 recorded miles.

JOD 969E


JOD969E is registered to a Grey 1967, Morris Minor 1000 with a Petrol engine. It Passed its most recent MOT Test on the 04 July 2018

36 unique faults (42 Total) reported in its MOT History (22 Tests).

6 common/recurring faults, the most frequent (2 times) is: Nearside Front Lower suspension swivel slight play.

59% (13) MOT Pass Rate and a 41% (9) MOT Failure Rate.

50,924 recorded miles.

MOT PASS/Failure rate for JOD 969E

all MOT test results for JOD 969E represented as a percentage
MOT PASS/Failure rate for JOD 969E
all MOT test results for JOD 969E represented as a percentage

PERCENTAGE OF VEHICLE FAULTS WITH JOD 969E

ALL REPORTED FAULTS, DISPLAYED BY PERCENTAGE OF OCCURRENCE DURING ALL MOT TESTS
PERCENTAGE OF VEHICLE FAULTS WITH JOD 969E
ALL REPORTED FAULTS, DISPLAYED BY PERCENTAGE OF OCCURRENCE DURING ALL MOT TESTS
ADVISORY

FAIL

USER ENTERED

PASS WITH RECTIFICATION

JOD 969E annual Faults by type

ALL REPORTED FAULTS, DISPLAYED over time and categorised by type
JOD 969E annual Faults by type
ALL REPORTED FAULTS, DISPLAYED over time and categorised by type

RECURRING FAULTS WITH JOD 969E

FAULTS THAT HAVE OCCURED MORE THAN ONCE DURING JOD 969E's MOT HISTORY
RECURRING FAULTS WITH JOD 969E
FAULTS THAT HAVE OCCURED MORE THAN ONCE DURING JOD 969E's MOT HISTORY
Fault Fault Test Date Test Date/Time Reference MOT Test Reference
2 Nearside front lower suspension swivel slight play Nearside front lower suspension swivel slight play 04 July 2017 [13:03] 04/07/2017 29 June 2017 [12:50] 29/06/2017 469362526683 469362526683 836284270358 836284270358
2 Nearside front lower suspension arm has slight play in a pin/bearing (2.4.g.2) Nearside front lower suspension arm has slight play in a pin/bearing (2.4.g.2) 06 July 2016 [07:26] 06/07/2016 27 June 2016 [15:06] 27/06/2016 310530213536 310530213536 444874625015 444874625015
2 Slight play at n/s/f lower suspension swivel Slight play at n/s/f lower suspension swivel 28 May 2015 [16:19] 28/05/2015 28 May 2015 [16:19] 28/05/2015 249418845421 249418845421 406948845194 406948845194
2 Nearside rear suspension spring mounting prescribed area is excessively corroded (2.4.a.3) Nearside rear suspension spring mounting prescribed area is excessively corroded (2.4.a.3) 13 June 2013 [14:56] 13/06/2013 10 April 2008 [11:00] 10/04/2008 797184263171 797184263171 623411108105 623411108105
2 Offside rear suspension spring mounting prescribed area is excessively corroded (2.4.a.3) Offside rear suspension spring mounting prescribed area is excessively corroded (2.4.a.3) 13 April 2010 [15:07] 13/04/2010 09 March 2006 [17:12] 09/03/2006 251403100150 251403100150 292748466088 292748466088
2 Registration plate lamp not working (1.1.5c) Registration plate lamp not working (1.1.5c) 20 April 2009 [16:38] 20/04/2009 10 April 2008 [11:00] 10/04/2008 203170419186 203170419186 623411108105 623411108105

ALL JOD 969E ADVISORIES [12]

ALL ADVISORIES, ORDERED by OCCURRENCE DURING JOD 969E's MOT HISTORY
ALL JOD 969E ADVISORIES [12]
ALL ADVISORIES, ORDERED by OCCURRENCE DURING JOD 969E's MOT HISTORY
Advisory Faults | source www.vehiclestats.co.uk
Fault Fault Test Date Test Date/Time Reference MOT Test Reference
2 Nearside front lower suspension swivel slight play Nearside front lower suspension swivel slight play 04 July 2017 [13:03] 04/07/2017 29 June 2017 [12:50] 29/06/2017 469362526683 469362526683 836284270358 836284270358
2 Nearside front lower suspension arm has slight play in a pin/bearing (2.4.g.2) Nearside front lower suspension arm has slight play in a pin/bearing (2.4.g.2) 06 July 2016 [07:26] 06/07/2016 27 June 2016 [15:06] 27/06/2016 310530213536 310530213536 444874625015 444874625015
1 Rear registration plate deteriorated but not likely to be misread (0.1 (b)) Rear registration plate deteriorated but not likely to be misread (0.1 (b)) 04 July 2018 [12:10] 04/07/2018 727938056939 727938056939
1 Nearside front axle swivel pins and bushes swivel pin and/or bush slightly worn (5.1.2 (b) (i)) Nearside front axle swivel pins and bushes swivel pin and/or bush slightly worn (5.1.2 (b) (i)) 04 July 2018 [12:10] 04/07/2018 727938056939 727938056939
1 Offside front service brake binding but not excessively (1.2.1 (f)) Offside front service brake binding but not excessively (1.2.1 (f)) 04 July 2018 [12:10] 04/07/2018 727938056939 727938056939
1 Offside rear service brake binding but not excessively (1.2.1 (f)) Offside rear service brake binding but not excessively (1.2.1 (f)) 04 July 2018 [12:10] 04/07/2018 727938056939 727938056939
1 Offside suspension component mounting prescribed area is corroded but not considered excessive (2.4.a.3) Offside suspension component mounting prescribed area is corroded but not considered excessive (2.4.a.3) 16 June 2014 [12:50] 16/06/2014 266947064497 266947064497
1 Offside front body has slight corrosion (6.1.b.2) Offside front body has slight corrosion (6.1.b.2) 27 May 2011 [12:51] 27/05/2011 167607641116 167607641116
1 Nearside front tyre worn close to the legal limit (4.1.e.1) Nearside front tyre worn close to the legal limit (4.1.e.1) 27 May 2011 [12:51] 27/05/2011 167607641116 167607641116
1 Nearside ball joint has slight play (2.2.b.1f) Nearside ball joint has slight play (2.2.b.1f) 27 May 2011 [12:51] 27/05/2011 167607641116 167607641116

ALL JOD 969E Failure Faults [23]

ALL Failure faults, ORDERED by OCCURRENCE DURING JOD 969E's MOT HISTORY
ALL JOD 969E Failure Faults [23]
ALL Failure faults, ORDERED by OCCURRENCE DURING JOD 969E's MOT HISTORY
Fail Faults | source www.vehiclestats.co.uk
Fault Fault Test Date Test Date/Time Reference MOT Test Reference
2 Nearside rear suspension spring mounting prescribed area is excessively corroded (2.4.a.3) Nearside rear suspension spring mounting prescribed area is excessively corroded (2.4.a.3) 13 June 2013 [14:56] 13/06/2013 10 April 2008 [11:00] 10/04/2008 797184263171 797184263171 623411108105 623411108105
2 Offside rear suspension spring mounting prescribed area is excessively corroded (2.4.a.3) Offside rear suspension spring mounting prescribed area is excessively corroded (2.4.a.3) 13 April 2010 [15:07] 13/04/2010 09 March 2006 [17:12] 09/03/2006 251403100150 251403100150 292748466088 292748466088
2 Registration plate lamp not working (1.1.5c) Registration plate lamp not working (1.1.5c) 20 April 2009 [16:38] 20/04/2009 10 April 2008 [11:00] 10/04/2008 203170419186 203170419186 623411108105 623411108105
1 Nearside rear suspension spring mounting prescribed area is excessively corroded chassis (2.4.a.3) Nearside rear suspension spring mounting prescribed area is excessively corroded chassis (2.4.a.3) 29 June 2017 [12:50] 29/06/2017 836284270358 836284270358
1 Nearside rear suspension spring mounting prescribed area is excessively corroded floor (2.4.a.3) Nearside rear suspension spring mounting prescribed area is excessively corroded floor (2.4.a.3) 29 June 2017 [12:50] 29/06/2017 836284270358 836284270358
1 Offside seat belt anchorage prescribed area is excessively corroded 'b' pillar top seatbelt mount area (5.2.6) Offside seat belt anchorage prescribed area is excessively corroded 'b' pillar top seatbelt mount area (5.2.6) 29 June 2017 [12:50] 29/06/2017 836284270358 836284270358
1 Offside suspension component mounting prescribed area is excessively corroded torsion bar mount (2.4.a.3) Offside suspension component mounting prescribed area is excessively corroded torsion bar mount (2.4.a.3) 27 June 2016 [15:06] 27/06/2016 444874625015 444874625015
1 Offside front brake master cylinder/servo mounting prescribed area is excessively corroded floor (3.6.c.3) Offside front brake master cylinder/servo mounting prescribed area is excessively corroded floor (3.6.c.3) 27 June 2016 [15:06] 27/06/2016 444874625015 444874625015
1 Nearside front tyre tread depth below requirements of 1.6mm (4.1.e.1) Nearside front tyre tread depth below requirements of 1.6mm (4.1.e.1) 13 June 2013 [14:56] 13/06/2013 797184263171 797184263171
1 Nearside front brake grabbing severely (3.7.a.2b) Nearside front brake grabbing severely (3.7.a.2b) 13 June 2013 [14:56] 13/06/2013 797184263171 797184263171
1 Brakes imbalanced across an axle (3.7.b.5b) Brakes imbalanced across an axle (3.7.b.5b) 13 June 2013 [14:56] 13/06/2013 797184263171 797184263171
1 Rear vehicle structure has excessive corrosion which adversely affects braking or steering (6.1.a.1) Rear vehicle structure has excessive corrosion which adversely affects braking or steering (6.1.a.1) 13 April 2010 [15:07] 13/04/2010 251403100150 251403100150
1 Centre vehicle structure has excessive corrosion which adversely affects braking or steering (6.1.a.1) Centre vehicle structure has excessive corrosion which adversely affects braking or steering (6.1.a.1) 13 April 2010 [15:07] 13/04/2010 251403100150 251403100150
1 Centre suspension component mounting prescribed area is excessively corroded (2.4.a.3) Centre suspension component mounting prescribed area is excessively corroded (2.4.a.3) 13 April 2010 [15:07] 13/04/2010 251403100150 251403100150
1 Offside front vehicle structure has excessive corrosion which adversely affects braking or steering (6.1.a.1) Offside front vehicle structure has excessive corrosion which adversely affects braking or steering (6.1.a.1) 20 April 2009 [16:38] 20/04/2009 203170419186 203170419186
1 Direction indicators not working (1.4.a.2c) Direction indicators not working (1.4.a.2c) 10 April 2008 [11:00] 10/04/2008 623411108105 623411108105
1 Nearside front suspension component mounting prescribed area is excessively corroded (2.4.a.3) Nearside front suspension component mounting prescribed area is excessively corroded (2.4.a.3) 10 April 2008 [11:00] 10/04/2008 623411108105 623411108105
1 Front windscreen wiper does not clear the windscreen effectively (8.2.2) Front windscreen wiper does not clear the windscreen effectively (8.2.2) 10 April 2008 [11:00] 10/04/2008 623411108105 623411108105
1 Nearside seat belt anchorage prescribed area is excessively corroded (5.2.6) Nearside seat belt anchorage prescribed area is excessively corroded (5.2.6) 10 April 2008 [11:00] 10/04/2008 623411108105 623411108105
1 Offside front suspension component mounting prescribed area is excessively corroded (2.4.a.3) Offside front suspension component mounting prescribed area is excessively corroded (2.4.a.3) 10 April 2008 [11:00] 10/04/2008 623411108105 623411108105

ALL JOD 969E User Entered Faults [4]

ALL User Entered faults, ORDERED by OCCURRENCE DURING JOD 969E's MOT HISTORY
ALL JOD 969E User Entered Faults [4]
ALL User Entered faults, ORDERED by OCCURRENCE DURING JOD 969E's MOT HISTORY
User Entered Faults | source www.vehiclestats.co.uk
Fault Fault Test Date Test Date/Time Reference MOT Test Reference
2 Slight play at n/s/f lower suspension swivel Slight play at n/s/f lower suspension swivel 28 May 2015 [16:19] 28/05/2015 28 May 2015 [16:19] 28/05/2015 249418845421 249418845421 406948845194 406948845194
1 Both rear tyres perishing Both rear tyres perishing 27 May 2011 [12:51] 27/05/2011 167607641116 167607641116
1 Rear tyres perished Rear tyres perished 10 April 2008 [11:00] 10/04/2008 623411108105 623411108105

ALL JOD 969E Pass With Rectification Faults [3]

ALL Pass With Rectification faults, ORDERED by OCCURRENCE DURING JOD 969E's MOT HISTORY
ALL JOD 969E Pass With Rectification Faults [3]
ALL Pass With Rectification faults, ORDERED by OCCURRENCE DURING JOD 969E's MOT HISTORY
Pass With Rectification Faults | source www.vehiclestats.co.uk
Fault Fault Test Date Test Date/Time Reference MOT Test Reference
1 Nearside front position lamp(s) not working (1.1.a.3b) Nearside front position lamp(s) not working (1.1.a.3b) 28 May 2015 [16:19] 28/05/2015 406948845194 406948845194
1 Offside headlamp not working on dipped beam (1.7.5a) Offside headlamp not working on dipped beam (1.7.5a) 15 May 2012 [13:09] 15/05/2012 475966432165 475966432165
1 Offside headlamp not working on main beam (1.7.5a) Offside headlamp not working on main beam (1.7.5a) 15 May 2012 [13:09] 15/05/2012 475966432165 475966432165

MOT TEST: 04 July 2018 12:10:21 PASSED
MOT TEST: 04 July 2018 12:10:21 PASSED

This test (727938056939) was completed on the 04 July 2018 12:10:21 and PASSED the requirements for a valid MOT with 4 comments.

This test (727938056939) was completed on the 04 July 2018 12:10:21 and PASSED the requirements for a valid MOT with 4 comments.

Recorded mileage: 50,924

Recorded mileage: 50,924


ADVISORY


MOT TEST: 04 July 2017 13:03:04 PASSED
MOT TEST: 04 July 2017 13:03:04 PASSED

This test (469362526683) was completed on the 04 July 2017 13:03:04 and PASSED the requirements for a valid MOT with 1 comments.

This test (469362526683) was completed on the 04 July 2017 13:03:04 and PASSED the requirements for a valid MOT with 1 comments.

Recorded mileage: 50,558

Recorded mileage: 50,558


ADVISORY


MOT TEST: 29 June 2017 12:50:16 FAILED
MOT TEST: 29 June 2017 12:50:16 FAILED

This test (836284270358) was completed on the 29 June 2017 12:50:16 and FAILED the requirements for a valid MOT with 4 comments.

This test (836284270358) was completed on the 29 June 2017 12:50:16 and FAILED the requirements for a valid MOT with 4 comments.

Recorded mileage: 50,546

Recorded mileage: 50,546


ADVISORY

FAIL


MOT TEST: 06 July 2016 07:26:17 PASSED
MOT TEST: 06 July 2016 07:26:17 PASSED

This test (310530213536) was completed on the 06 July 2016 07:26:17 and PASSED the requirements for a valid MOT with 1 comments.

This test (310530213536) was completed on the 06 July 2016 07:26:17 and PASSED the requirements for a valid MOT with 1 comments.

Recorded mileage: 50,354

Recorded mileage: 50,354


ADVISORY


MOT TEST: 27 June 2016 15:06:46 FAILED
MOT TEST: 27 June 2016 15:06:46 FAILED

This test (444874625015) was completed on the 27 June 2016 15:06:46 and FAILED the requirements for a valid MOT with 3 comments.

This test (444874625015) was completed on the 27 June 2016 15:06:46 and FAILED the requirements for a valid MOT with 3 comments.

Recorded mileage: 50,350

Recorded mileage: 50,350


ADVISORY

FAIL


MOT TEST: 28 May 2015 16:19:52 PASSED
MOT TEST: 28 May 2015 16:19:52 PASSED

This test (249418845421) was completed on the 28 May 2015 16:19:52 and PASSED the requirements for a valid MOT with 1 comments.

This test (249418845421) was completed on the 28 May 2015 16:19:52 and PASSED the requirements for a valid MOT with 1 comments.

Recorded mileage: 50,097

Recorded mileage: 50,097


USER ENTERED


MOT TEST: 28 May 2015 16:19:52 FAILED
MOT TEST: 28 May 2015 16:19:52 FAILED

This test (406948845194) was completed on the 28 May 2015 16:19:52 and FAILED the requirements for a valid MOT with 2 comments.

This test (406948845194) was completed on the 28 May 2015 16:19:52 and FAILED the requirements for a valid MOT with 2 comments.

Recorded mileage: 50,097

Recorded mileage: 50,097


USER ENTERED

PASS WITH RECTIFICATION


MOT TEST: 16 June 2014 12:50:40 PASSED
MOT TEST: 16 June 2014 12:50:40 PASSED

This test (266947064497) was completed on the 16 June 2014 12:50:40 and PASSED the requirements for a valid MOT with 1 comments.

This test (266947064497) was completed on the 16 June 2014 12:50:40 and PASSED the requirements for a valid MOT with 1 comments.

Recorded mileage: 49,705

Recorded mileage: 49,705


ADVISORY


MOT TEST: 27 June 2013 17:13:03 PASSED
MOT TEST: 27 June 2013 17:13:03 PASSED

This test (277348873469) was completed on the 27 June 2013 17:13:03 and PASSED the requirements for a valid MOT with 0 comments.

This test (277348873469) was completed on the 27 June 2013 17:13:03 and PASSED the requirements for a valid MOT with 0 comments.

Recorded mileage: 48,936

Recorded mileage: 48,936


MOT TEST: 13 June 2013 14:56:52 FAILED
MOT TEST: 13 June 2013 14:56:52 FAILED

This test (797184263171) was completed on the 13 June 2013 14:56:52 and FAILED the requirements for a valid MOT with 4 comments.

This test (797184263171) was completed on the 13 June 2013 14:56:52 and FAILED the requirements for a valid MOT with 4 comments.

Recorded mileage: 48,897

Recorded mileage: 48,897


FAIL


MOT TEST: 15 May 2012 13:09:00 PASSED
MOT TEST: 15 May 2012 13:09:00 PASSED

This test (906686532188) was completed on the 15 May 2012 13:09:00 and PASSED the requirements for a valid MOT with 0 comments.

This test (906686532188) was completed on the 15 May 2012 13:09:00 and PASSED the requirements for a valid MOT with 0 comments.

Recorded mileage: 48,394

Recorded mileage: 48,394


MOT TEST: 15 May 2012 13:09:00 FAILED
MOT TEST: 15 May 2012 13:09:00 FAILED

This test (475966432165) was completed on the 15 May 2012 13:09:00 and FAILED the requirements for a valid MOT with 2 comments.

This test (475966432165) was completed on the 15 May 2012 13:09:00 and FAILED the requirements for a valid MOT with 2 comments.

Recorded mileage: 48,394

Recorded mileage: 48,394


PASS WITH RECTIFICATION


MOT TEST: 27 May 2011 12:51:10 PASSED
MOT TEST: 27 May 2011 12:51:10 PASSED

This test (167607641116) was completed on the 27 May 2011 12:51:10 and PASSED the requirements for a valid MOT with 4 comments.

This test (167607641116) was completed on the 27 May 2011 12:51:10 and PASSED the requirements for a valid MOT with 4 comments.

Recorded mileage: 47,873

Recorded mileage: 47,873


ADVISORY

USER ENTERED


MOT TEST: 17 May 2010 11:26:56 PASSED
MOT TEST: 17 May 2010 11:26:56 PASSED

This test (741667730188) was completed on the 17 May 2010 11:26:56 and PASSED the requirements for a valid MOT with 0 comments.

This test (741667730188) was completed on the 17 May 2010 11:26:56 and PASSED the requirements for a valid MOT with 0 comments.

Recorded mileage: 46,955

Recorded mileage: 46,955


MOT TEST: 13 April 2010 15:07:55 FAILED
MOT TEST: 13 April 2010 15:07:55 FAILED

This test (251403100150) was completed on the 13 April 2010 15:07:55 and FAILED the requirements for a valid MOT with 4 comments.

This test (251403100150) was completed on the 13 April 2010 15:07:55 and FAILED the requirements for a valid MOT with 4 comments.

Recorded mileage: 46,887

Recorded mileage: 46,887


FAIL


MOT TEST: 24 April 2009 12:16:03 PASSED
MOT TEST: 24 April 2009 12:16:03 PASSED

This test (711824019124) was completed on the 24 April 2009 12:16:03 and PASSED the requirements for a valid MOT with 0 comments.

This test (711824019124) was completed on the 24 April 2009 12:16:03 and PASSED the requirements for a valid MOT with 0 comments.

Recorded mileage: 46,077

Recorded mileage: 46,077


MOT TEST: 20 April 2009 16:38:02 FAILED
MOT TEST: 20 April 2009 16:38:02 FAILED

This test (203170419186) was completed on the 20 April 2009 16:38:02 and FAILED the requirements for a valid MOT with 2 comments.

This test (203170419186) was completed on the 20 April 2009 16:38:02 and FAILED the requirements for a valid MOT with 2 comments.

Recorded mileage: 46,038

Recorded mileage: 46,038


FAIL


MOT TEST: 24 April 2008 13:43:56 PASSED
MOT TEST: 24 April 2008 13:43:56 PASSED

This test (231565918132) was completed on the 24 April 2008 13:43:56 and PASSED the requirements for a valid MOT with 0 comments.

This test (231565918132) was completed on the 24 April 2008 13:43:56 and PASSED the requirements for a valid MOT with 0 comments.

Recorded mileage: 45,205

Recorded mileage: 45,205


MOT TEST: 10 April 2008 11:00:41 FAILED
MOT TEST: 10 April 2008 11:00:41 FAILED

This test (623411108105) was completed on the 10 April 2008 11:00:41 and FAILED the requirements for a valid MOT with 8 comments.

This test (623411108105) was completed on the 10 April 2008 11:00:41 and FAILED the requirements for a valid MOT with 8 comments.

Recorded mileage: 45,195

Recorded mileage: 45,195


FAIL

USER ENTERED


MOT TEST: 19 April 2007 15:15:58 PASSED
MOT TEST: 19 April 2007 15:15:58 PASSED

This test (212009807124) was completed on the 19 April 2007 15:15:58 and PASSED the requirements for a valid MOT with 0 comments.

This test (212009807124) was completed on the 19 April 2007 15:15:58 and PASSED the requirements for a valid MOT with 0 comments.

Recorded mileage: 44,054

Recorded mileage: 44,054


MOT TEST: 04 April 2006 11:38:39 PASSED
MOT TEST: 04 April 2006 11:38:39 PASSED

This test (372344296011) was completed on the 04 April 2006 11:38:39 and PASSED the requirements for a valid MOT with 0 comments.

This test (372344296011) was completed on the 04 April 2006 11:38:39 and PASSED the requirements for a valid MOT with 0 comments.

Recorded mileage: 43,250

Recorded mileage: 43,250


MOT TEST: 09 March 2006 17:12:50 FAILED
MOT TEST: 09 March 2006 17:12:50 FAILED

This test (292748466088) was completed on the 09 March 2006 17:12:50 and FAILED the requirements for a valid MOT with 1 comments.

This test (292748466088) was completed on the 09 March 2006 17:12:50 and FAILED the requirements for a valid MOT with 1 comments.

Recorded mileage: 43,239

Recorded mileage: 43,239


FAIL