JOF 101N


JOF101N is registered to a Red 1975, Morris Mini 1275 gt with a Petrol engine. It Failed its most recent MOT Test on the 16 March 2018

17 unique faults (17 Total) reported in its MOT History (10 Tests).

0 common/recurring faults.

80% (8) MOT Pass Rate and a 20% (2) MOT Failure Rate.

2,793 recorded miles.

JOF 101N


JOF101N is registered to a Red 1975, Morris Mini 1275 gt with a Petrol engine. It Failed its most recent MOT Test on the 16 March 2018

17 unique faults (17 Total) reported in its MOT History (10 Tests).

0 common/recurring faults.

80% (8) MOT Pass Rate and a 20% (2) MOT Failure Rate.

2,793 recorded miles.

MOT PASS/Failure rate for JOF 101N

all MOT test results for JOF 101N represented as a percentage
MOT PASS/Failure rate for JOF 101N
all MOT test results for JOF 101N represented as a percentage

PERCENTAGE OF VEHICLE FAULTS WITH JOF 101N

ALL REPORTED FAULTS, DISPLAYED BY PERCENTAGE OF OCCURRENCE DURING ALL MOT TESTS
PERCENTAGE OF VEHICLE FAULTS WITH JOF 101N
ALL REPORTED FAULTS, DISPLAYED BY PERCENTAGE OF OCCURRENCE DURING ALL MOT TESTS
ADVISORY

FAIL

USER ENTERED

JOF 101N annual Faults by type

ALL REPORTED FAULTS, DISPLAYED over time and categorised by type
JOF 101N annual Faults by type
ALL REPORTED FAULTS, DISPLAYED over time and categorised by type

ALL JOF 101N ADVISORIES [1]

ALL ADVISORIES, ORDERED by OCCURRENCE DURING JOF 101N's MOT HISTORY
ALL JOF 101N ADVISORIES [1]
ALL ADVISORIES, ORDERED by OCCURRENCE DURING JOF 101N's MOT HISTORY
Advisory Faults | source www.vehiclestats.co.uk
Fault Fault Test Date Test Date/Time Reference MOT Test Reference
1 Offside front suspension arm has slight play in a ball joint (2.4.g.2) Offside front suspension arm has slight play in a ball joint (2.4.g.2) 29 August 2008 [13:09] 29/08/2008 153042248207 153042248207

ALL JOF 101N Failure Faults [9]

ALL Failure faults, ORDERED by OCCURRENCE DURING JOF 101N's MOT HISTORY
ALL JOF 101N Failure Faults [9]
ALL Failure faults, ORDERED by OCCURRENCE DURING JOF 101N's MOT HISTORY
Fail Faults | source www.vehiclestats.co.uk
Fault Fault Test Date Test Date/Time Reference MOT Test Reference
1 Nearside headlamp not working on dipped beam (1.7.5a) Nearside headlamp not working on dipped beam (1.7.5a) 08 August 2008 [10:03] 08/08/2008 894421828264 894421828264
1 Offside headlamp not working on dipped beam (1.7.5a) Offside headlamp not working on dipped beam (1.7.5a) 08 August 2008 [10:03] 08/08/2008 894421828264 894421828264
1 Windscreen washer provides insufficient washer liquid (8.2.3) Windscreen washer provides insufficient washer liquid (8.2.3) 12 March 2007 [17:18] 12/03/2007 831341477035 831341477035
1 Nearside windscreen wiper not operating automatically when switched on (8.2.1b) Nearside windscreen wiper not operating automatically when switched on (8.2.1b) 12 March 2007 [17:18] 12/03/2007 831341477035 831341477035
1 Offside windscreen wiper not operating automatically when switched on (8.2.1b) Offside windscreen wiper not operating automatically when switched on (8.2.1b) 12 March 2007 [17:18] 12/03/2007 831341477035 831341477035
1 Front body insecure and dangerous to other road users (6.1.b.1b) Front body insecure and dangerous to other road users (6.1.b.1b) 12 March 2007 [17:18] 12/03/2007 831341477035 831341477035
1 Offside rear brake recording little or no effort (3.7.b.5a) Offside rear brake recording little or no effort (3.7.b.5a) 12 March 2007 [17:18] 12/03/2007 831341477035 831341477035
1 Offside rear parking brake recording little or no effort (3.7.b.6a) Offside rear parking brake recording little or no effort (3.7.b.6a) 12 March 2007 [17:18] 12/03/2007 831341477035 831341477035
1 Parking brake: efficiency below requirements (3.7.b.7) Parking brake: efficiency below requirements (3.7.b.7) 12 March 2007 [17:18] 12/03/2007 831341477035 831341477035

ALL JOF 101N User Entered Faults [7]

ALL User Entered faults, ORDERED by OCCURRENCE DURING JOF 101N's MOT HISTORY
ALL JOF 101N User Entered Faults [7]
ALL User Entered faults, ORDERED by OCCURRENCE DURING JOF 101N's MOT HISTORY
User Entered Faults | source www.vehiclestats.co.uk
Fault Fault Test Date Test Date/Time Reference MOT Test Reference
1 Underside of vehicle signs of corrosion (fully under sealed) Underside of vehicle signs of corrosion (fully under sealed) 20 June 2014 [14:34] 20/06/2014 736291874133 736291874133
1 Front seats mountings just satisfactory Front seats mountings just satisfactory 20 June 2014 [14:34] 20/06/2014 736291874133 736291874133
1 Non standard wheels and tyres fitted Non standard wheels and tyres fitted 29 August 2008 [13:09] 29/08/2008 153042248207 153042248207
1 Non standard tail lmap assys. Fitted Non standard tail lmap assys. Fitted 29 August 2008 [13:09] 29/08/2008 153042248207 153042248207
1 Unable to fully assess the condition of outer sills due to body side skirts being fitted Unable to fully assess the condition of outer sills due to body side skirts being fitted 29 August 2008 [13:09] 29/08/2008 153042248207 153042248207
1 Oil leak Oil leak 29 August 2008 [13:09] 29/08/2008 153042248207 153042248207
1 Nearside front flexible hose routing not ideal. Not fouling on anything during test. Nearside front flexible hose routing not ideal. Not fouling on anything during test. 29 August 2008 [13:09] 29/08/2008 153042248207 153042248207

MOT TEST: 16 March 2018 12:48:59 PASSED
MOT TEST: 16 March 2018 12:48:59 PASSED

This test (176943640903) was completed on the 16 March 2018 12:48:59 and PASSED the requirements for a valid MOT with 0 comments.

This test (176943640903) was completed on the 16 March 2018 12:48:59 and PASSED the requirements for a valid MOT with 0 comments.

Recorded mileage: 2,793

Recorded mileage: 2,793


MOT TEST: 15 March 2017 12:42:34 PASSED
MOT TEST: 15 March 2017 12:42:34 PASSED

This test (566455625923) was completed on the 15 March 2017 12:42:34 and PASSED the requirements for a valid MOT with 0 comments.

This test (566455625923) was completed on the 15 March 2017 12:42:34 and PASSED the requirements for a valid MOT with 0 comments.

Recorded mileage: 2,221

Recorded mileage: 2,221


MOT TEST: 07 March 2016 12:47:01 PASSED
MOT TEST: 07 March 2016 12:47:01 PASSED

This test (358698363502) was completed on the 07 March 2016 12:47:01 and PASSED the requirements for a valid MOT with 0 comments.

This test (358698363502) was completed on the 07 March 2016 12:47:01 and PASSED the requirements for a valid MOT with 0 comments.

Recorded mileage: 1,645

Recorded mileage: 1,645


MOT TEST: 20 June 2014 14:34:41 PASSED
MOT TEST: 20 June 2014 14:34:41 PASSED

This test (736291874133) was completed on the 20 June 2014 14:34:41 and PASSED the requirements for a valid MOT with 2 comments.

This test (736291874133) was completed on the 20 June 2014 14:34:41 and PASSED the requirements for a valid MOT with 2 comments.

Recorded mileage: 1,099

Recorded mileage: 1,099


USER ENTERED


MOT TEST: 20 June 2013 12:48:16 PASSED
MOT TEST: 20 June 2013 12:48:16 PASSED

This test (239951073186) was completed on the 20 June 2013 12:48:16 and PASSED the requirements for a valid MOT with 0 comments.

This test (239951073186) was completed on the 20 June 2013 12:48:16 and PASSED the requirements for a valid MOT with 0 comments.

Recorded mileage: 823

Recorded mileage: 823


MOT TEST: 06 August 2009 11:20:25 PASSED
MOT TEST: 06 August 2009 11:20:25 PASSED

This test (973018519296) was completed on the 06 August 2009 11:20:25 and PASSED the requirements for a valid MOT with 0 comments.

This test (973018519296) was completed on the 06 August 2009 11:20:25 and PASSED the requirements for a valid MOT with 0 comments.

Recorded mileage: 692

Recorded mileage: 692


MOT TEST: 29 August 2008 13:09:12 PASSED
MOT TEST: 29 August 2008 13:09:12 PASSED

This test (153042248207) was completed on the 29 August 2008 13:09:12 and PASSED the requirements for a valid MOT with 6 comments.

This test (153042248207) was completed on the 29 August 2008 13:09:12 and PASSED the requirements for a valid MOT with 6 comments.

Recorded mileage: 408

Recorded mileage: 408


ADVISORY

USER ENTERED


MOT TEST: 08 August 2008 10:03:56 FAILED
MOT TEST: 08 August 2008 10:03:56 FAILED

This test (894421828264) was completed on the 08 August 2008 10:03:56 and FAILED the requirements for a valid MOT with 2 comments.

This test (894421828264) was completed on the 08 August 2008 10:03:56 and FAILED the requirements for a valid MOT with 2 comments.

Recorded mileage: 389

Recorded mileage: 389


FAIL


MOT TEST: 23 March 2007 16:08:59 PASSED
MOT TEST: 23 March 2007 16:08:59 PASSED

This test (562702287072) was completed on the 23 March 2007 16:08:59 and PASSED the requirements for a valid MOT with 0 comments.

This test (562702287072) was completed on the 23 March 2007 16:08:59 and PASSED the requirements for a valid MOT with 0 comments.

Recorded mileage: 170

Recorded mileage: 170


MOT TEST: 12 March 2007 17:18:41 FAILED
MOT TEST: 12 March 2007 17:18:41 FAILED

This test (831341477035) was completed on the 12 March 2007 17:18:41 and FAILED the requirements for a valid MOT with 7 comments.

This test (831341477035) was completed on the 12 March 2007 17:18:41 and FAILED the requirements for a valid MOT with 7 comments.

Recorded mileage: 170

Recorded mileage: 170


FAIL