JOF 720E


JOF720E is registered to a Blue 1967, Morris Minor 1000 with a Petrol engine. It Failed its most recent MOT Test on the 20 September 2017

7 unique faults (8 Total) reported in its MOT History (9 Tests).

1 common/recurring faults.

78% (7) MOT Pass Rate and a 22% (2) MOT Failure Rate.

351,235 recorded miles.

JOF 720E


JOF720E is registered to a Blue 1967, Morris Minor 1000 with a Petrol engine. It Failed its most recent MOT Test on the 20 September 2017

7 unique faults (8 Total) reported in its MOT History (9 Tests).

1 common/recurring faults.

78% (7) MOT Pass Rate and a 22% (2) MOT Failure Rate.

351,235 recorded miles.

MOT PASS/Failure rate for JOF 720E

all MOT test results for JOF 720E represented as a percentage
MOT PASS/Failure rate for JOF 720E
all MOT test results for JOF 720E represented as a percentage

PERCENTAGE OF VEHICLE FAULTS WITH JOF 720E

ALL REPORTED FAULTS, DISPLAYED BY PERCENTAGE OF OCCURRENCE DURING ALL MOT TESTS
PERCENTAGE OF VEHICLE FAULTS WITH JOF 720E
ALL REPORTED FAULTS, DISPLAYED BY PERCENTAGE OF OCCURRENCE DURING ALL MOT TESTS
FAIL

USER ENTERED

JOF 720E annual Faults by type

ALL REPORTED FAULTS, DISPLAYED over time and categorised by type
JOF 720E annual Faults by type
ALL REPORTED FAULTS, DISPLAYED over time and categorised by type

ALL JOF 720E Failure Faults [5]

ALL Failure faults, ORDERED by OCCURRENCE DURING JOF 720E's MOT HISTORY
ALL JOF 720E Failure Faults [5]
ALL Failure faults, ORDERED by OCCURRENCE DURING JOF 720E's MOT HISTORY
Fail Faults | source www.vehiclestats.co.uk
Fault Fault Test Date Test Date/Time Reference MOT Test Reference
1 Registration plate lamp not working (1.1.c.1d) Registration plate lamp not working (1.1.c.1d) 03 July 2010 [13:57] 03/07/2010 292354080418 292354080418
1 Parking brake: efficiency below requirements (3.7.b.7) Parking brake: efficiency below requirements (3.7.b.7) 03 July 2010 [13:57] 03/07/2010 292354080418 292354080418
1 Brakes imbalanced across an axle (3.7.b.5b) Brakes imbalanced across an axle (3.7.b.5b) 03 July 2010 [13:57] 03/07/2010 292354080418 292354080418
1 Nearside headlamp not working on main beam (1.7.5a) Nearside headlamp not working on main beam (1.7.5a) 06 March 2008 [12:10] 06/03/2008 551736468070 551736468070
1 Offside headlamp not working on main beam (1.7.5a) Offside headlamp not working on main beam (1.7.5a) 06 March 2008 [12:10] 06/03/2008 551736468070 551736468070

ALL JOF 720E User Entered Faults [3]

ALL User Entered faults, ORDERED by OCCURRENCE DURING JOF 720E's MOT HISTORY
ALL JOF 720E User Entered Faults [3]
ALL User Entered faults, ORDERED by OCCURRENCE DURING JOF 720E's MOT HISTORY
Fail Faults | source www.vehiclestats.co.uk
Fault Fault Test Date Test Date/Time Reference MOT Test Reference
2 Coolant leak Coolant leak 03 July 2010 [13:57] 03/07/2010 12 June 2009 [15:58] 12/06/2009 292354080418 292354080418 772773169106 772773169106
1 Advisehand brake travel Advisehand brake travel 12 June 2009 [15:58] 12/06/2009 772773169106 772773169106

MOT TEST: 20 September 2017 06:41:25 PASSED
MOT TEST: 20 September 2017 06:41:25 PASSED

This test (532778225566) was completed on the 20 September 2017 06:41:25 and PASSED the requirements for a valid MOT with 0 comments.

This test (532778225566) was completed on the 20 September 2017 06:41:25 and PASSED the requirements for a valid MOT with 0 comments.

Recorded mileage: 35,449

Recorded mileage: 35,449


MOT TEST: 18 June 2015 12:01:17 PASSED
MOT TEST: 18 June 2015 12:01:17 PASSED

This test (225639265413) was completed on the 18 June 2015 12:01:17 and PASSED the requirements for a valid MOT with 0 comments.

This test (225639265413) was completed on the 18 June 2015 12:01:17 and PASSED the requirements for a valid MOT with 0 comments.

Recorded mileage: 35,305

Recorded mileage: 35,305


MOT TEST: 12 June 2014 13:40:04 PASSED
MOT TEST: 12 June 2014 13:40:04 PASSED

This test (285363464115) was completed on the 12 June 2014 13:40:04 and PASSED the requirements for a valid MOT with 0 comments.

This test (285363464115) was completed on the 12 June 2014 13:40:04 and PASSED the requirements for a valid MOT with 0 comments.

Recorded mileage: 35,277

Recorded mileage: 35,277


MOT TEST: 03 July 2013 11:18:27 PASSED
MOT TEST: 03 July 2013 11:18:27 PASSED

This test (166204383188) was completed on the 03 July 2013 11:18:27 and PASSED the requirements for a valid MOT with 0 comments.

This test (166204383188) was completed on the 03 July 2013 11:18:27 and PASSED the requirements for a valid MOT with 0 comments.

Recorded mileage: 35,136

Recorded mileage: 35,136


MOT TEST: 29 July 2010 14:21:09 PASSED
MOT TEST: 29 July 2010 14:21:09 PASSED

This test (311000810279) was completed on the 29 July 2010 14:21:09 and PASSED the requirements for a valid MOT with 0 comments.

This test (311000810279) was completed on the 29 July 2010 14:21:09 and PASSED the requirements for a valid MOT with 0 comments.

Recorded mileage: 351,235

Recorded mileage: 351,235


MOT TEST: 03 July 2010 13:57:12 FAILED
MOT TEST: 03 July 2010 13:57:12 FAILED

This test (292354080418) was completed on the 03 July 2010 13:57:12 and FAILED the requirements for a valid MOT with 4 comments.

This test (292354080418) was completed on the 03 July 2010 13:57:12 and FAILED the requirements for a valid MOT with 4 comments.

Recorded mileage: 35,122

Recorded mileage: 35,122


FAIL

USER ENTERED


MOT TEST: 12 June 2009 15:58:47 PASSED
MOT TEST: 12 June 2009 15:58:47 PASSED

This test (772773169106) was completed on the 12 June 2009 15:58:47 and PASSED the requirements for a valid MOT with 2 comments.

This test (772773169106) was completed on the 12 June 2009 15:58:47 and PASSED the requirements for a valid MOT with 2 comments.

Recorded mileage: 34,656

Recorded mileage: 34,656


USER ENTERED


MOT TEST: 07 April 2008 11:47:11 PASSED
MOT TEST: 07 April 2008 11:47:11 PASSED

This test (530438598054) was completed on the 07 April 2008 11:47:11 and PASSED the requirements for a valid MOT with 0 comments.

This test (530438598054) was completed on the 07 April 2008 11:47:11 and PASSED the requirements for a valid MOT with 0 comments.

Recorded mileage: 34,071

Recorded mileage: 34,071


MOT TEST: 06 March 2008 12:10:26 FAILED
MOT TEST: 06 March 2008 12:10:26 FAILED

This test (551736468070) was completed on the 06 March 2008 12:10:26 and FAILED the requirements for a valid MOT with 2 comments.

This test (551736468070) was completed on the 06 March 2008 12:10:26 and FAILED the requirements for a valid MOT with 2 comments.

Recorded mileage: 34,005

Recorded mileage: 34,005


FAIL