JOG 613E


JOG613E is registered to a Green 1967, Morris Minor 1000 with a Petrol engine. It Failed its most recent MOT Test on the 18 June 2006

4 unique faults (4 Total) reported in its MOT History (2 Tests).

0 common/recurring faults.

50% (1) MOT Pass Rate and a 50% (1) MOT Failure Rate.

65,613 recorded miles.

JOG 613E


JOG613E is registered to a Green 1967, Morris Minor 1000 with a Petrol engine. It Failed its most recent MOT Test on the 18 June 2006

4 unique faults (4 Total) reported in its MOT History (2 Tests).

0 common/recurring faults.

50% (1) MOT Pass Rate and a 50% (1) MOT Failure Rate.

65,613 recorded miles.

MOT PASS/Failure rate for JOG 613E

all MOT test results for JOG 613E represented as a percentage
MOT PASS/Failure rate for JOG 613E
all MOT test results for JOG 613E represented as a percentage

PERCENTAGE OF VEHICLE FAULTS WITH JOG 613E

ALL REPORTED FAULTS, DISPLAYED BY PERCENTAGE OF OCCURRENCE DURING ALL MOT TESTS
PERCENTAGE OF VEHICLE FAULTS WITH JOG 613E
ALL REPORTED FAULTS, DISPLAYED BY PERCENTAGE OF OCCURRENCE DURING ALL MOT TESTS
FAIL

JOG 613E annual Faults by type

ALL REPORTED FAULTS, DISPLAYED over time and categorised by type
JOG 613E annual Faults by type
ALL REPORTED FAULTS, DISPLAYED over time and categorised by type

ALL JOG 613E Failure Faults [4]

ALL Failure faults, ORDERED by OCCURRENCE DURING JOG 613E's MOT HISTORY
ALL JOG 613E Failure Faults [4]
ALL Failure faults, ORDERED by OCCURRENCE DURING JOG 613E's MOT HISTORY
Fail Faults | source www.vehiclestats.co.uk
Fault Fault Test Date Test Date/Time Reference MOT Test Reference
1 All position lamps not working (1.1.a.3b) All position lamps not working (1.1.a.3b) 04 May 2006 [18:17] 04/05/2006 221064426184 221064426184
1 Registration plate lamp not working (1.1.5c) Registration plate lamp not working (1.1.5c) 04 May 2006 [18:17] 04/05/2006 221064426184 221064426184
1 Nearside stop lamp not working (1.2.1b) Nearside stop lamp not working (1.2.1b) 04 May 2006 [18:17] 04/05/2006 221064426184 221064426184
1 Offside front brake hose excessively deteriorated (3.6.b.4d) Offside front brake hose excessively deteriorated (3.6.b.4d) 04 May 2006 [18:17] 04/05/2006 221064426184 221064426184

MOT TEST: 18 June 2006 14:51:21 PASSED
MOT TEST: 18 June 2006 14:51:21 PASSED

This test (790009366178) was completed on the 18 June 2006 14:51:21 and PASSED the requirements for a valid MOT with 0 comments.

This test (790009366178) was completed on the 18 June 2006 14:51:21 and PASSED the requirements for a valid MOT with 0 comments.

Recorded mileage: 65,613

Recorded mileage: 65,613


MOT TEST: 04 May 2006 18:17:13 FAILED
MOT TEST: 04 May 2006 18:17:13 FAILED

This test (221064426184) was completed on the 04 May 2006 18:17:13 and FAILED the requirements for a valid MOT with 4 comments.

This test (221064426184) was completed on the 04 May 2006 18:17:13 and FAILED the requirements for a valid MOT with 4 comments.

Recorded mileage: 65,613

Recorded mileage: 65,613


FAIL