JRX 612D


JRX612D is registered to a Red 1966, Morris 6 cwt van with a Petrol engine. It Passed its most recent MOT Test on the 17 July 2018

21 unique faults (25 Total) reported in its MOT History (16 Tests).

4 common/recurring faults, the most frequent (2 times) is: Front Brake pipe slightly damaged (3.6.B.2c).

69% (11) MOT Pass Rate and a 31% (5) MOT Failure Rate.

91,837 recorded miles.

JRX 612D


JRX612D is registered to a Red 1966, Morris 6 cwt van with a Petrol engine. It Passed its most recent MOT Test on the 17 July 2018

21 unique faults (25 Total) reported in its MOT History (16 Tests).

4 common/recurring faults, the most frequent (2 times) is: Front Brake pipe slightly damaged (3.6.B.2c).

69% (11) MOT Pass Rate and a 31% (5) MOT Failure Rate.

91,837 recorded miles.

MOT PASS/Failure rate for JRX 612D

all MOT test results for JRX 612D represented as a percentage
MOT PASS/Failure rate for JRX 612D
all MOT test results for JRX 612D represented as a percentage

PERCENTAGE OF VEHICLE FAULTS WITH JRX 612D

ALL REPORTED FAULTS, DISPLAYED BY PERCENTAGE OF OCCURRENCE DURING ALL MOT TESTS
PERCENTAGE OF VEHICLE FAULTS WITH JRX 612D
ALL REPORTED FAULTS, DISPLAYED BY PERCENTAGE OF OCCURRENCE DURING ALL MOT TESTS
ADVISORY

FAIL

PASS WITH RECTIFICATION

JRX 612D annual Faults by type

ALL REPORTED FAULTS, DISPLAYED over time and categorised by type
JRX 612D annual Faults by type
ALL REPORTED FAULTS, DISPLAYED over time and categorised by type

RECURRING FAULTS WITH JRX 612D

FAULTS THAT HAVE OCCURED MORE THAN ONCE DURING JRX 612D's MOT HISTORY
RECURRING FAULTS WITH JRX 612D
FAULTS THAT HAVE OCCURED MORE THAN ONCE DURING JRX 612D's MOT HISTORY
Fault Fault Test Date Test Date/Time Reference MOT Test Reference
2 Front brake pipe slightly damaged (3.6.b.2c) Front brake pipe slightly damaged (3.6.b.2c) 14 July 2015 [17:41] 14/07/2015 10 July 2015 [12:42] 10/07/2015 628805195174 628805195174 807921795172 807921795172
2 Nearside front brake pipe slightly damaged (2.2.d.2b) Nearside front brake pipe slightly damaged (2.2.d.2b) 14 July 2015 [17:41] 14/07/2015 10 July 2015 [12:42] 10/07/2015 628805195174 628805195174 807921795172 807921795172
2 Front brake pipe slightly damaged (2.2.d.2b) Front brake pipe slightly damaged (2.2.d.2b) 14 July 2015 [17:41] 14/07/2015 10 July 2015 [12:42] 10/07/2015 628805195174 628805195174 807921795172 807921795172
2 Nearside front suspension has slight play in a upper suspension ball joint (2.5.b.1a) Nearside front suspension has slight play in a upper suspension ball joint (2.5.b.1a) 14 July 2015 [17:41] 14/07/2015 10 July 2015 [12:42] 10/07/2015 628805195174 628805195174 807921795172 807921795172

ALL JRX 612D ADVISORIES [15]

ALL ADVISORIES, ORDERED by OCCURRENCE DURING JRX 612D's MOT HISTORY
ALL JRX 612D ADVISORIES [15]
ALL ADVISORIES, ORDERED by OCCURRENCE DURING JRX 612D's MOT HISTORY
Advisory Faults | source www.vehiclestats.co.uk
Fault Fault Test Date Test Date/Time Reference MOT Test Reference
2 Front brake pipe slightly damaged (3.6.b.2c) Front brake pipe slightly damaged (3.6.b.2c) 14 July 2015 [17:41] 14/07/2015 10 July 2015 [12:42] 10/07/2015 628805195174 628805195174 807921795172 807921795172
2 Nearside front brake pipe slightly damaged (2.2.d.2b) Nearside front brake pipe slightly damaged (2.2.d.2b) 14 July 2015 [17:41] 14/07/2015 10 July 2015 [12:42] 10/07/2015 628805195174 628805195174 807921795172 807921795172
2 Front brake pipe slightly damaged (2.2.d.2b) Front brake pipe slightly damaged (2.2.d.2b) 14 July 2015 [17:41] 14/07/2015 10 July 2015 [12:42] 10/07/2015 628805195174 628805195174 807921795172 807921795172
2 Nearside front suspension has slight play in a upper suspension ball joint (2.5.b.1a) Nearside front suspension has slight play in a upper suspension ball joint (2.5.b.1a) 14 July 2015 [17:41] 14/07/2015 10 July 2015 [12:42] 10/07/2015 628805195174 628805195174 807921795172 807921795172
1 Nearside front front suspension has slight play in a upper suspension ball joint (2.5.b.1a) Nearside front front suspension has slight play in a upper suspension ball joint (2.5.b.1a) 29 July 2016 [08:03] 29/07/2016 164184032724 164184032724
1 Nearside front upper front suspension ball joint dust cover deteriorated, but preventing the ingress of dirt (2.4.g.2) Nearside front upper front suspension ball joint dust cover deteriorated, but preventing the ingress of dirt (2.4.g.2) 29 July 2016 [08:03] 29/07/2016 164184032724 164184032724
1 Offside front upper front suspension ball joint dust cover deteriorated, but preventing the ingress of dirt (2.4.g.2) Offside front upper front suspension ball joint dust cover deteriorated, but preventing the ingress of dirt (2.4.g.2) 29 July 2016 [08:03] 29/07/2016 164184032724 164184032724
1 Parking brake: parking brake efficiency only just met. It would appear that the braking system requires adjustment or repair. (3.7.c.1b) Parking brake: parking brake efficiency only just met. It would appear that the braking system requires adjustment or repair. (3.7.c.1b) 24 June 2014 [14:58] 24/06/2014 965515974120 965515974120
1 Nearside steering rack gaiter deteriorated (2.2.d.2d) Nearside steering rack gaiter deteriorated (2.2.d.2d) 22 June 2010 [15:05] 22/06/2010 154653270153 154653270153
1 Nearside track rod end ball joint has slight play (2.2.b.1f) Nearside track rod end ball joint has slight play (2.2.b.1f) 22 June 2010 [15:05] 22/06/2010 154653270153 154653270153
1 Offside front tyre worn close to the legal limit (4.1.e.1) Offside front tyre worn close to the legal limit (4.1.e.1) 22 June 2010 [15:05] 22/06/2010 154653270153 154653270153

ALL JRX 612D Failure Faults [7]

ALL Failure faults, ORDERED by OCCURRENCE DURING JRX 612D's MOT HISTORY
ALL JRX 612D Failure Faults [7]
ALL Failure faults, ORDERED by OCCURRENCE DURING JRX 612D's MOT HISTORY
Fail Faults | source www.vehiclestats.co.uk
Fault Fault Test Date Test Date/Time Reference MOT Test Reference
1 Parking brake: efficiency below requirements (3.7.c.1b) Parking brake: efficiency below requirements (3.7.c.1b) 10 July 2015 [12:42] 10/07/2015 807921795172 807921795172
1 Windscreen washer provides insufficient washer liquid (8.2.3) Windscreen washer provides insufficient washer liquid (8.2.3) 10 July 2015 [12:42] 10/07/2015 807921795172 807921795172
1 Nearside front wheel bearing rough when rotated (2.5.a.2) Nearside front wheel bearing rough when rotated (2.5.a.2) 10 July 2015 [12:42] 10/07/2015 807921795172 807921795172
1 Nearside front front wheel bearing rough when rotated (2.5.a.2) Nearside front front wheel bearing rough when rotated (2.5.a.2) 24 June 2014 [14:58] 24/06/2014 965515974120 965515974120
1 Horn not working (1.6.2a) Horn not working (1.6.2a) 15 June 2011 [15:30] 15/06/2011 996276961164 996276961164
1 Nearside front direction indicator not working (1.4.a.2c) Nearside front direction indicator not working (1.4.a.2c) 15 June 2011 [15:30] 15/06/2011 996276961164 996276961164
1 Offside front direction indicator not working (1.4.a.2c) Offside front direction indicator not working (1.4.a.2c) 15 June 2011 [15:30] 15/06/2011 996276961164 996276961164

ALL JRX 612D Pass With Rectification Faults [3]

ALL Pass With Rectification faults, ORDERED by OCCURRENCE DURING JRX 612D's MOT HISTORY
ALL JRX 612D Pass With Rectification Faults [3]
ALL Pass With Rectification faults, ORDERED by OCCURRENCE DURING JRX 612D's MOT HISTORY
Pass With Rectification Faults | source www.vehiclestats.co.uk
Fault Fault Test Date Test Date/Time Reference MOT Test Reference
1 Rear registration plate lamp not working (1.1.5c) Rear registration plate lamp not working (1.1.5c) 12 March 2008 [17:52] 12/03/2008 501412278002 501412278002
1 Front fuel pipe leaking (7.2.3) Front fuel pipe leaking (7.2.3) 12 March 2008 [17:52] 12/03/2008 501412278002 501412278002
1 Offside headlamp aim too far to the right (1.8) Offside headlamp aim too far to the right (1.8) 02 April 2007 [15:28] 02/04/2007 261552797095 261552797095

MOT TEST: 17 July 2018 13:08:59 PASSED
MOT TEST: 17 July 2018 13:08:59 PASSED

This test (454857890714) was completed on the 17 July 2018 13:08:59 and PASSED the requirements for a valid MOT with 0 comments.

This test (454857890714) was completed on the 17 July 2018 13:08:59 and PASSED the requirements for a valid MOT with 0 comments.

Recorded mileage: 42,144

Recorded mileage: 42,144


MOT TEST: 27 July 2017 11:12:33 PASSED
MOT TEST: 27 July 2017 11:12:33 PASSED

This test (420723652102) was completed on the 27 July 2017 11:12:33 and PASSED the requirements for a valid MOT with 0 comments.

This test (420723652102) was completed on the 27 July 2017 11:12:33 and PASSED the requirements for a valid MOT with 0 comments.

Recorded mileage: 31,512

Recorded mileage: 31,512


MOT TEST: 29 July 2016 08:03:57 PASSED
MOT TEST: 29 July 2016 08:03:57 PASSED

This test (164184032724) was completed on the 29 July 2016 08:03:57 and PASSED the requirements for a valid MOT with 3 comments.

This test (164184032724) was completed on the 29 July 2016 08:03:57 and PASSED the requirements for a valid MOT with 3 comments.

Recorded mileage: 25,811

Recorded mileage: 25,811


ADVISORY


MOT TEST: 14 July 2015 17:41:15 PASSED
MOT TEST: 14 July 2015 17:41:15 PASSED

This test (628805195174) was completed on the 14 July 2015 17:41:15 and PASSED the requirements for a valid MOT with 4 comments.

This test (628805195174) was completed on the 14 July 2015 17:41:15 and PASSED the requirements for a valid MOT with 4 comments.

Recorded mileage: 14,891

Recorded mileage: 14,891


ADVISORY


MOT TEST: 10 July 2015 12:42:14 FAILED
MOT TEST: 10 July 2015 12:42:14 FAILED

This test (807921795172) was completed on the 10 July 2015 12:42:14 and FAILED the requirements for a valid MOT with 7 comments.

This test (807921795172) was completed on the 10 July 2015 12:42:14 and FAILED the requirements for a valid MOT with 7 comments.

Recorded mileage: 14,890

Recorded mileage: 14,890


ADVISORY

FAIL


MOT TEST: 27 June 2014 13:09:52 PASSED
MOT TEST: 27 June 2014 13:09:52 PASSED

This test (206758274108) was completed on the 27 June 2014 13:09:52 and PASSED the requirements for a valid MOT with 0 comments.

This test (206758274108) was completed on the 27 June 2014 13:09:52 and PASSED the requirements for a valid MOT with 0 comments.

Recorded mileage: 3,966

Recorded mileage: 3,966


MOT TEST: 24 June 2014 14:58:44 FAILED
MOT TEST: 24 June 2014 14:58:44 FAILED

This test (965515974120) was completed on the 24 June 2014 14:58:44 and FAILED the requirements for a valid MOT with 2 comments.

This test (965515974120) was completed on the 24 June 2014 14:58:44 and FAILED the requirements for a valid MOT with 2 comments.

Recorded mileage: 3,785

Recorded mileage: 3,785


ADVISORY

FAIL


MOT TEST: 18 July 2013 15:12:42 PASSED
MOT TEST: 18 July 2013 15:12:42 PASSED

This test (468989693167) was completed on the 18 July 2013 15:12:42 and PASSED the requirements for a valid MOT with 0 comments.

This test (468989693167) was completed on the 18 July 2013 15:12:42 and PASSED the requirements for a valid MOT with 0 comments.

Recorded mileage: 0

Recorded mileage: 0


MOT TEST: 20 June 2011 15:36:09 PASSED
MOT TEST: 20 June 2011 15:36:09 PASSED

This test (549941771142) was completed on the 20 June 2011 15:36:09 and PASSED the requirements for a valid MOT with 0 comments.

This test (549941771142) was completed on the 20 June 2011 15:36:09 and PASSED the requirements for a valid MOT with 0 comments.

Recorded mileage: 10,094

Recorded mileage: 10,094


MOT TEST: 15 June 2011 15:30:51 FAILED
MOT TEST: 15 June 2011 15:30:51 FAILED

This test (996276961164) was completed on the 15 June 2011 15:30:51 and FAILED the requirements for a valid MOT with 3 comments.

This test (996276961164) was completed on the 15 June 2011 15:30:51 and FAILED the requirements for a valid MOT with 3 comments.

Recorded mileage: 10,094

Recorded mileage: 10,094


FAIL


MOT TEST: 22 June 2010 15:05:15 PASSED
MOT TEST: 22 June 2010 15:05:15 PASSED

This test (154653270153) was completed on the 22 June 2010 15:05:15 and PASSED the requirements for a valid MOT with 3 comments.

This test (154653270153) was completed on the 22 June 2010 15:05:15 and PASSED the requirements for a valid MOT with 3 comments.

Recorded mileage: 3,005

Recorded mileage: 3,005


ADVISORY


MOT TEST: 03 July 2009 10:16:06 PASSED
MOT TEST: 03 July 2009 10:16:06 PASSED

This test (632874189130) was completed on the 03 July 2009 10:16:06 and PASSED the requirements for a valid MOT with 0 comments.

This test (632874189130) was completed on the 03 July 2009 10:16:06 and PASSED the requirements for a valid MOT with 0 comments.

Recorded mileage: 91,837

Recorded mileage: 91,837


MOT TEST: 12 March 2008 17:52:23 FAILED
MOT TEST: 12 March 2008 17:52:23 FAILED

This test (501412278002) was completed on the 12 March 2008 17:52:23 and FAILED the requirements for a valid MOT with 2 comments.

This test (501412278002) was completed on the 12 March 2008 17:52:23 and FAILED the requirements for a valid MOT with 2 comments.

Recorded mileage: 91,133

Recorded mileage: 91,133


PASS WITH RECTIFICATION


MOT TEST: 12 March 2008 17:52:23 PASSED
MOT TEST: 12 March 2008 17:52:23 PASSED

This test (192302078493) was completed on the 12 March 2008 17:52:23 and PASSED the requirements for a valid MOT with 0 comments.

This test (192302078493) was completed on the 12 March 2008 17:52:23 and PASSED the requirements for a valid MOT with 0 comments.

Recorded mileage: 91,133

Recorded mileage: 91,133


MOT TEST: 02 April 2007 15:28:51 PASSED
MOT TEST: 02 April 2007 15:28:51 PASSED

This test (262462797034) was completed on the 02 April 2007 15:28:51 and PASSED the requirements for a valid MOT with 0 comments.

This test (262462797034) was completed on the 02 April 2007 15:28:51 and PASSED the requirements for a valid MOT with 0 comments.

Recorded mileage: 90,503

Recorded mileage: 90,503


MOT TEST: 02 April 2007 15:28:51 FAILED
MOT TEST: 02 April 2007 15:28:51 FAILED

This test (261552797095) was completed on the 02 April 2007 15:28:51 and FAILED the requirements for a valid MOT with 1 comments.

This test (261552797095) was completed on the 02 April 2007 15:28:51 and FAILED the requirements for a valid MOT with 1 comments.

Recorded mileage: 90,503

Recorded mileage: 90,503


PASS WITH RECTIFICATION