JUN 554F


JUN554F is registered to a Green 1967, Morris Minor 1000 with a Petrol engine. It Passed its most recent MOT Test on the 06 September 2018

13 unique faults (15 Total) reported in its MOT History (15 Tests).

1 common/recurring faults.

80% (12) MOT Pass Rate and a 20% (3) MOT Failure Rate.

99,397 recorded miles.

JUN 554F


JUN554F is registered to a Green 1967, Morris Minor 1000 with a Petrol engine. It Passed its most recent MOT Test on the 06 September 2018

13 unique faults (15 Total) reported in its MOT History (15 Tests).

1 common/recurring faults.

80% (12) MOT Pass Rate and a 20% (3) MOT Failure Rate.

99,397 recorded miles.

MOT PASS/Failure rate for JUN 554F

all MOT test results for JUN 554F represented as a percentage
MOT PASS/Failure rate for JUN 554F
all MOT test results for JUN 554F represented as a percentage

PERCENTAGE OF VEHICLE FAULTS WITH JUN 554F

ALL REPORTED FAULTS, DISPLAYED BY PERCENTAGE OF OCCURRENCE DURING ALL MOT TESTS
PERCENTAGE OF VEHICLE FAULTS WITH JUN 554F
ALL REPORTED FAULTS, DISPLAYED BY PERCENTAGE OF OCCURRENCE DURING ALL MOT TESTS
ADVISORY

FAIL

JUN 554F annual Faults by type

ALL REPORTED FAULTS, DISPLAYED over time and categorised by type
JUN 554F annual Faults by type
ALL REPORTED FAULTS, DISPLAYED over time and categorised by type

ALL JUN 554F ADVISORIES [2]

ALL ADVISORIES, ORDERED by OCCURRENCE DURING JUN 554F's MOT HISTORY
ALL JUN 554F ADVISORIES [2]
ALL ADVISORIES, ORDERED by OCCURRENCE DURING JUN 554F's MOT HISTORY
Advisory Faults | source www.vehiclestats.co.uk
Fault Fault Test Date Test Date/Time Reference MOT Test Reference
2 Oil leak, but not excessive (8.4.1 (a) (i)) Oil leak, but not excessive (8.4.1 (a) (i)) 06 September 2018 [08:01] 06/09/2018 05 September 2018 [07:45] 05/09/2018 468293579191 468293579191 773576127863 773576127863

ALL JUN 554F Failure Faults [13]

ALL Failure faults, ORDERED by OCCURRENCE DURING JUN 554F's MOT HISTORY
ALL JUN 554F Failure Faults [13]
ALL Failure faults, ORDERED by OCCURRENCE DURING JUN 554F's MOT HISTORY
Fail Faults | source www.vehiclestats.co.uk
Fault Fault Test Date Test Date/Time Reference MOT Test Reference
1 Nearside front upper suspension arm pin or bush excessively worn (5.3.4 (a) (i)) Nearside front upper suspension arm pin or bush excessively worn (5.3.4 (a) (i)) 05 September 2018 [07:45] 05/09/2018 773576127863 773576127863
1 Nearside rear suspension component mounting prescribed area excessively corroded significantly reducing structural strength inner wheel arch (5.3.6 (a) (i)) Nearside rear suspension component mounting prescribed area excessively corroded significantly reducing structural strength inner wheel arch (5.3.6 (a) (i)) 05 September 2018 [07:45] 05/09/2018 773576127863 773576127863
1 Parking brake efficiency below requirements (1.4.2 (a) (i)) Parking brake efficiency below requirements (1.4.2 (a) (i)) 05 September 2018 [07:45] 05/09/2018 773576127863 773576127863
1 Nearside front service brake excessively binding (1.2.1 (f)) Nearside front service brake excessively binding (1.2.1 (f)) 05 September 2018 [07:45] 05/09/2018 773576127863 773576127863
1 Parking (secondary brake) on a single line braking system imbalanced across an axle axle 1 (1.3.1 (b) (i)) Parking (secondary brake) on a single line braking system imbalanced across an axle axle 1 (1.3.1 (b) (i)) 05 September 2018 [07:45] 05/09/2018 773576127863 773576127863
1 Nearside front brake recording little or no effort (3.7.b.5a) Nearside front brake recording little or no effort (3.7.b.5a) 12 June 2017 [10:40] 12/06/2017 833604994358 833604994358
1 Front brake application uneven (3.7.b.2) Front brake application uneven (3.7.b.2) 12 June 2017 [10:40] 12/06/2017 833604994358 833604994358
1 Offside rear brake binding (3.7.b.1) Offside rear brake binding (3.7.b.1) 12 June 2017 [10:40] 12/06/2017 833604994358 833604994358
1 Offside front suspension has excessive play in a upper suspension ball joint top trunion joint (2.5.b.1a) Offside front suspension has excessive play in a upper suspension ball joint top trunion joint (2.5.b.1a) 12 June 2017 [10:40] 12/06/2017 833604994358 833604994358
1 Front brakes imbalanced across an axle (3.7.b.5b) Front brakes imbalanced across an axle (3.7.b.5b) 12 June 2017 [10:40] 12/06/2017 833604994358 833604994358
1 Brakes imbalanced across an axle (3.7.b.5b) Brakes imbalanced across an axle (3.7.b.5b) 12 June 2017 [10:40] 12/06/2017 833604994358 833604994358
1 Suspension component mounting prescribed area is excessively corroded (2.4.a.3) Suspension component mounting prescribed area is excessively corroded (2.4.a.3) 04 July 2013 [13:51] 04/07/2013 887385183124 887385183124

MOT TEST: 06 September 2018 08:01:19 PASSED
MOT TEST: 06 September 2018 08:01:19 PASSED

This test (468293579191) was completed on the 06 September 2018 08:01:19 and PASSED the requirements for a valid MOT with 1 comments.

This test (468293579191) was completed on the 06 September 2018 08:01:19 and PASSED the requirements for a valid MOT with 1 comments.

Recorded mileage: 1,954

Recorded mileage: 1,954


ADVISORY


MOT TEST: 05 September 2018 07:45:13 FAILED
MOT TEST: 05 September 2018 07:45:13 FAILED

This test (773576127863) was completed on the 05 September 2018 07:45:13 and FAILED the requirements for a valid MOT with 7 comments.

This test (773576127863) was completed on the 05 September 2018 07:45:13 and FAILED the requirements for a valid MOT with 7 comments.

Recorded mileage: 1,952

Recorded mileage: 1,952


ADVISORY

FAIL


MOT TEST: 14 June 2017 12:56:22 PASSED
MOT TEST: 14 June 2017 12:56:22 PASSED

This test (856028531819) was completed on the 14 June 2017 12:56:22 and PASSED the requirements for a valid MOT with 0 comments.

This test (856028531819) was completed on the 14 June 2017 12:56:22 and PASSED the requirements for a valid MOT with 0 comments.

Recorded mileage: 1,631

Recorded mileage: 1,631


MOT TEST: 12 June 2017 10:40:56 FAILED
MOT TEST: 12 June 2017 10:40:56 FAILED

This test (833604994358) was completed on the 12 June 2017 10:40:56 and FAILED the requirements for a valid MOT with 6 comments.

This test (833604994358) was completed on the 12 June 2017 10:40:56 and FAILED the requirements for a valid MOT with 6 comments.

Recorded mileage: 1,619

Recorded mileage: 1,619


FAIL


MOT TEST: 01 June 2016 08:38:02 PASSED
MOT TEST: 01 June 2016 08:38:02 PASSED

This test (711042087895) was completed on the 01 June 2016 08:38:02 and PASSED the requirements for a valid MOT with 0 comments.

This test (711042087895) was completed on the 01 June 2016 08:38:02 and PASSED the requirements for a valid MOT with 0 comments.

Recorded mileage: 1,391

Recorded mileage: 1,391


MOT TEST: 02 June 2015 12:11:54 PASSED
MOT TEST: 02 June 2015 12:11:54 PASSED

This test (108613455195) was completed on the 02 June 2015 12:11:54 and PASSED the requirements for a valid MOT with 0 comments.

This test (108613455195) was completed on the 02 June 2015 12:11:54 and PASSED the requirements for a valid MOT with 0 comments.

Recorded mileage: 445

Recorded mileage: 445


MOT TEST: 12 June 2014 13:50:14 PASSED
MOT TEST: 12 June 2014 13:50:14 PASSED

This test (998643064162) was completed on the 12 June 2014 13:50:14 and PASSED the requirements for a valid MOT with 0 comments.

This test (998643064162) was completed on the 12 June 2014 13:50:14 and PASSED the requirements for a valid MOT with 0 comments.

Recorded mileage: 99,397

Recorded mileage: 99,397


MOT TEST: 08 July 2013 11:04:45 PASSED
MOT TEST: 08 July 2013 11:04:45 PASSED

This test (218539083474) was completed on the 08 July 2013 11:04:45 and PASSED the requirements for a valid MOT with 0 comments.

This test (218539083474) was completed on the 08 July 2013 11:04:45 and PASSED the requirements for a valid MOT with 0 comments.

Recorded mileage: 98,261

Recorded mileage: 98,261


MOT TEST: 04 July 2013 13:51:06 FAILED
MOT TEST: 04 July 2013 13:51:06 FAILED

This test (887385183124) was completed on the 04 July 2013 13:51:06 and FAILED the requirements for a valid MOT with 1 comments.

This test (887385183124) was completed on the 04 July 2013 13:51:06 and FAILED the requirements for a valid MOT with 1 comments.

Recorded mileage: 98,261

Recorded mileage: 98,261


FAIL


MOT TEST: 06 July 2012 11:18:59 PASSED
MOT TEST: 06 July 2012 11:18:59 PASSED

This test (209308482491) was completed on the 06 July 2012 11:18:59 and PASSED the requirements for a valid MOT with 0 comments.

This test (209308482491) was completed on the 06 July 2012 11:18:59 and PASSED the requirements for a valid MOT with 0 comments.

Recorded mileage: 96,893

Recorded mileage: 96,893


MOT TEST: 08 July 2011 11:35:02 PASSED
MOT TEST: 08 July 2011 11:35:02 PASSED

This test (775679581162) was completed on the 08 July 2011 11:35:02 and PASSED the requirements for a valid MOT with 0 comments.

This test (775679581162) was completed on the 08 July 2011 11:35:02 and PASSED the requirements for a valid MOT with 0 comments.

Recorded mileage: 94,994

Recorded mileage: 94,994


MOT TEST: 07 July 2010 10:45:34 PASSED
MOT TEST: 07 July 2010 10:45:34 PASSED

This test (690608680157) was completed on the 07 July 2010 10:45:34 and PASSED the requirements for a valid MOT with 0 comments.

This test (690608680157) was completed on the 07 July 2010 10:45:34 and PASSED the requirements for a valid MOT with 0 comments.

Recorded mileage: 94,761

Recorded mileage: 94,761


MOT TEST: 10 July 2009 12:45:17 PASSED
MOT TEST: 10 July 2009 12:45:17 PASSED

This test (294031299461) was completed on the 10 July 2009 12:45:17 and PASSED the requirements for a valid MOT with 0 comments.

This test (294031299461) was completed on the 10 July 2009 12:45:17 and PASSED the requirements for a valid MOT with 0 comments.

Recorded mileage: 94,443

Recorded mileage: 94,443


MOT TEST: 24 June 2008 14:32:14 PASSED
MOT TEST: 24 June 2008 14:32:14 PASSED

This test (124146578132) was completed on the 24 June 2008 14:32:14 and PASSED the requirements for a valid MOT with 0 comments.

This test (124146578132) was completed on the 24 June 2008 14:32:14 and PASSED the requirements for a valid MOT with 0 comments.

Recorded mileage: 94,022

Recorded mileage: 94,022


MOT TEST: 26 June 2007 10:20:09 PASSED
MOT TEST: 26 June 2007 10:20:09 PASSED

This test (420527877103) was completed on the 26 June 2007 10:20:09 and PASSED the requirements for a valid MOT with 0 comments.

This test (420527877103) was completed on the 26 June 2007 10:20:09 and PASSED the requirements for a valid MOT with 0 comments.

Recorded mileage: 93,544

Recorded mileage: 93,544