JUN 625P


JUN625P is registered to a Blue 1975, Morris Mini 1000 with a Petrol engine. It Failed its most recent MOT Test on the 07 July 2017

41 unique faults (46 Total) reported in its MOT History (17 Tests).

4 common/recurring faults, the most frequent (3 times) is: Exhaust emissions carbon monoxide content excessive (7.3.B.1a).

59% (10) MOT Pass Rate and a 41% (7) MOT Failure Rate.

112,162 recorded miles.

JUN 625P


JUN625P is registered to a Blue 1975, Morris Mini 1000 with a Petrol engine. It Failed its most recent MOT Test on the 07 July 2017

41 unique faults (46 Total) reported in its MOT History (17 Tests).

4 common/recurring faults, the most frequent (3 times) is: Exhaust emissions carbon monoxide content excessive (7.3.B.1a).

59% (10) MOT Pass Rate and a 41% (7) MOT Failure Rate.

112,162 recorded miles.

MOT PASS/Failure rate for JUN 625P

all MOT test results for JUN 625P represented as a percentage
MOT PASS/Failure rate for JUN 625P
all MOT test results for JUN 625P represented as a percentage

PERCENTAGE OF VEHICLE FAULTS WITH JUN 625P

ALL REPORTED FAULTS, DISPLAYED BY PERCENTAGE OF OCCURRENCE DURING ALL MOT TESTS
PERCENTAGE OF VEHICLE FAULTS WITH JUN 625P
ALL REPORTED FAULTS, DISPLAYED BY PERCENTAGE OF OCCURRENCE DURING ALL MOT TESTS
ADVISORY

FAIL

USER ENTERED

JUN 625P annual Faults by type

ALL REPORTED FAULTS, DISPLAYED over time and categorised by type
JUN 625P annual Faults by type
ALL REPORTED FAULTS, DISPLAYED over time and categorised by type

RECURRING FAULTS WITH JUN 625P

FAULTS THAT HAVE OCCURED MORE THAN ONCE DURING JUN 625P's MOT HISTORY
RECURRING FAULTS WITH JUN 625P
FAULTS THAT HAVE OCCURED MORE THAN ONCE DURING JUN 625P's MOT HISTORY
Fault Fault Test Date Test Date/Time Reference MOT Test Reference
3 Exhaust emissions carbon monoxide content excessive (7.3.b.1a) Exhaust emissions carbon monoxide content excessive (7.3.b.1a) 06 November 2014 [16:18] 06/11/2014 11 October 2010 [15:55] 11/10/2010 26 February 2008 [10:00] 26/02/2008 727390014311 727390014311 294074380296 294074380296 712547558035 712547558035
2 Rear seat removed Rear seat removed 16 June 2016 [15:23] 16/06/2016 15 June 2016 [12:00] 15/06/2016 537591968544 537591968544 143042877127 143042877127
2 Offside front tyre worn close to the legal limit (4.1.e.1) Offside front tyre worn close to the legal limit (4.1.e.1) 23 October 2010 [13:22] 23/10/2010 11 October 2010 [15:55] 11/10/2010 114226190282 114226190282 294074380296 294074380296
2 Oil leak Oil leak 23 October 2010 [13:22] 23/10/2010 11 October 2010 [15:55] 11/10/2010 114226190282 114226190282 294074380296 294074380296

ALL JUN 625P ADVISORIES [6]

ALL ADVISORIES, ORDERED by OCCURRENCE DURING JUN 625P's MOT HISTORY
ALL JUN 625P ADVISORIES [6]
ALL ADVISORIES, ORDERED by OCCURRENCE DURING JUN 625P's MOT HISTORY
Advisory Faults | source www.vehiclestats.co.uk
Fault Fault Test Date Test Date/Time Reference MOT Test Reference
2 Rear seat removed Rear seat removed 16 June 2016 [15:23] 16/06/2016 15 June 2016 [12:00] 15/06/2016 537591968544 537591968544 143042877127 143042877127
2 Offside front tyre worn close to the legal limit (4.1.e.1) Offside front tyre worn close to the legal limit (4.1.e.1) 23 October 2010 [13:22] 23/10/2010 11 October 2010 [15:55] 11/10/2010 114226190282 114226190282 294074380296 294074380296
1 Offside rear service brake: service brake efficiency only just met. It would appear that the braking system requires adjustment or repair. (3.7.b.7) Offside rear service brake: service brake efficiency only just met. It would appear that the braking system requires adjustment or repair. (3.7.b.7) 11 October 2010 [15:55] 11/10/2010 294074380296 294074380296
1 Offside parking brake: parking brake efficiency only just met. It would appear that the braking system requires adjustment or repair. (3.7.b.7) Offside parking brake: parking brake efficiency only just met. It would appear that the braking system requires adjustment or repair. (3.7.b.7) 11 October 2010 [15:55] 11/10/2010 294074380296 294074380296

ALL JUN 625P Failure Faults [35]

ALL Failure faults, ORDERED by OCCURRENCE DURING JUN 625P's MOT HISTORY
ALL JUN 625P Failure Faults [35]
ALL Failure faults, ORDERED by OCCURRENCE DURING JUN 625P's MOT HISTORY
Fail Faults | source www.vehiclestats.co.uk
Fault Fault Test Date Test Date/Time Reference MOT Test Reference
3 Exhaust emissions carbon monoxide content excessive (7.3.b.1a) Exhaust emissions carbon monoxide content excessive (7.3.b.1a) 06 November 2014 [16:18] 06/11/2014 11 October 2010 [15:55] 11/10/2010 26 February 2008 [10:00] 26/02/2008 727390014311 727390014311 294074380296 294074380296 712547558035 712547558035
1 Electrical wiring damaged, likely to cause a short battery cable (1.9.2b) Electrical wiring damaged, likely to cause a short battery cable (1.9.2b) 07 July 2017 [12:26] 07/07/2017 353025194882 353025194882
1 Nearside track rod end ball joint dust cover excessively deteriorated so that it no longer prevents the ingress of dirt (2.2.c.1c) Nearside track rod end ball joint dust cover excessively deteriorated so that it no longer prevents the ingress of dirt (2.2.c.1c) 07 July 2017 [12:26] 07/07/2017 353025194882 353025194882
1 Parking brake: efficiency below requirements (3.7.b.7) Parking brake: efficiency below requirements (3.7.b.7) 15 June 2016 [12:00] 15/06/2016 143042877127 143042877127
1 Front position lamp(s) not working both (1.1.a.3b) Front position lamp(s) not working both (1.1.a.3b) 15 June 2016 [12:00] 15/06/2016 143042877127 143042877127
1 Steering column top bearing excessively worn (2.1.2c) Steering column top bearing excessively worn (2.1.2c) 15 June 2016 [12:00] 15/06/2016 143042877127 143042877127
1 Front suspension has a suspension lower ball joint securing nut not locked offside (2.5.b.1a) Front suspension has a suspension lower ball joint securing nut not locked offside (2.5.b.1a) 15 June 2016 [12:00] 15/06/2016 143042877127 143042877127
1 Front suspension has excessive movement at a suspension ball joint offside (2.5.a.1c) Front suspension has excessive movement at a suspension ball joint offside (2.5.a.1c) 15 June 2016 [12:00] 15/06/2016 143042877127 143042877127
1 Rear parking brake recording little or no effort both sides (3.7.b.6a) Rear parking brake recording little or no effort both sides (3.7.b.6a) 15 June 2016 [12:00] 15/06/2016 143042877127 143042877127
1 Offside obligatory mirror is incapable of being adjusted to provide an adequate view to the rear (8.1.2b) Offside obligatory mirror is incapable of being adjusted to provide an adequate view to the rear (8.1.2b) 06 November 2014 [16:18] 06/11/2014 727390014311 727390014311
1 Windscreen wiper does not clear the windscreen effectively (8.2.2) Windscreen wiper does not clear the windscreen effectively (8.2.2) 06 November 2014 [16:18] 06/11/2014 727390014311 727390014311
1 Windscreen washer provides insufficient washer liquid (8.2.3) Windscreen washer provides insufficient washer liquid (8.2.3) 06 November 2014 [16:18] 06/11/2014 727390014311 727390014311
1 Brake pedal anti-slip provision missing (3.3.a.1b) Brake pedal anti-slip provision missing (3.3.a.1b) 06 November 2014 [16:18] 06/11/2014 727390014311 727390014311
1 Nearside headlamp aim too low (1.8) Nearside headlamp aim too low (1.8) 06 November 2014 [16:18] 06/11/2014 727390014311 727390014311
1 Offside headlamp aim too high (1.8) Offside headlamp aim too high (1.8) 06 November 2014 [16:18] 06/11/2014 727390014311 727390014311
1 Offside rear subframe mounting prescribed area is excessively corroded (2.4.a.3) Offside rear subframe mounting prescribed area is excessively corroded (2.4.a.3) 06 November 2014 [16:18] 06/11/2014 727390014311 727390014311
1 Front suspension component mounting prescribed area is excessively corroded (2.4.a.3) Front suspension component mounting prescribed area is excessively corroded (2.4.a.3) 06 November 2014 [16:18] 06/11/2014 727390014311 727390014311
1 Nearside front wheel bearing has excessive play (2.5.a.3c) Nearside front wheel bearing has excessive play (2.5.a.3c) 06 November 2014 [16:18] 06/11/2014 727390014311 727390014311
1 Nearside front suspension retaining device missing (2.5.a.4) Nearside front suspension retaining device missing (2.5.a.4) 06 November 2014 [16:18] 06/11/2014 727390014311 727390014311
1 Rear road wheel fixings not compatible (4.2.b.2) Rear road wheel fixings not compatible (4.2.b.2) 06 November 2014 [16:18] 06/11/2014 727390014311 727390014311
1 Offside front tyre tread depth below requirements of 1.6mm (4.1.e.1) Offside front tyre tread depth below requirements of 1.6mm (4.1.e.1) 21 June 2012 [14:57] 21/06/2012 186333572134 186333572134
1 Nearside rear tyre has a cut in excess of the requirements deep enough to reach the ply or cords (4.1.d.1a) Nearside rear tyre has a cut in excess of the requirements deep enough to reach the ply or cords (4.1.d.1a) 21 June 2012 [14:57] 21/06/2012 186333572134 186333572134
1 Offside front windscreen washer provides insufficient washer liquid (8.2.3) Offside front windscreen washer provides insufficient washer liquid (8.2.3) 21 June 2012 [14:57] 21/06/2012 186333572134 186333572134
1 Nearside front windscreen washer provides insufficient washer liquid (8.2.3) Nearside front windscreen washer provides insufficient washer liquid (8.2.3) 21 June 2012 [14:57] 21/06/2012 186333572134 186333572134
1 Offside front front constant velocity joint gaiter damaged to the extent that it no longer prevents the ingress of dirt etc (2.5.c.1a) Offside front front constant velocity joint gaiter damaged to the extent that it no longer prevents the ingress of dirt etc (2.5.c.1a) 21 June 2012 [14:57] 21/06/2012 186333572134 186333572134
1 Offside lower front suspension has excessive play in a lower suspension ball joint (2.5.b.1a) Offside lower front suspension has excessive play in a lower suspension ball joint (2.5.b.1a) 21 June 2012 [14:57] 21/06/2012 186333572134 186333572134
1 Offside front direction indicators incorrect colour (1.4.a.2f) Offside front direction indicators incorrect colour (1.4.a.2f) 11 October 2010 [15:55] 11/10/2010 294074380296 294074380296
1 Nearside steering rack gaiter split (2.2.d.2d) Nearside steering rack gaiter split (2.2.d.2d) 11 October 2010 [15:55] 11/10/2010 294074380296 294074380296
1 Offside steering rack gaiter split (2.2.d.2d) Offside steering rack gaiter split (2.2.d.2d) 11 October 2010 [15:55] 11/10/2010 294074380296 294074380296
1 Drivers door cannot be opened from outside the vehicle (6.2.b.1b) Drivers door cannot be opened from outside the vehicle (6.2.b.1b) 11 October 2010 [15:55] 11/10/2010 294074380296 294074380296
1 Exhaust emissions hydrocarbon content excessive (7.3.b.1b) Exhaust emissions hydrocarbon content excessive (7.3.b.1b) 11 October 2010 [15:55] 11/10/2010 294074380296 294074380296
1 Nearside rear brake recording little or no effort (3.7.b.5a) Nearside rear brake recording little or no effort (3.7.b.5a) 19 October 2009 [16:47] 19/10/2009 373382399216 373382399216
1 Nearside rear parking brake recording little or no effort (3.7.b.6a) Nearside rear parking brake recording little or no effort (3.7.b.6a) 19 October 2009 [16:47] 19/10/2009 373382399216 373382399216

ALL JUN 625P User Entered Faults [5]

ALL User Entered faults, ORDERED by OCCURRENCE DURING JUN 625P's MOT HISTORY
ALL JUN 625P User Entered Faults [5]
ALL User Entered faults, ORDERED by OCCURRENCE DURING JUN 625P's MOT HISTORY
Advisory Faults | source www.vehiclestats.co.uk
Fault Fault Test Date Test Date/Time Reference MOT Test Reference
2 Oil leak Oil leak 23 October 2010 [13:22] 23/10/2010 11 October 2010 [15:55] 11/10/2010 114226190282 114226190282 294074380296 294074380296
1 Wheel/tyre protruding beyond wheel arch Wheel/tyre protruding beyond wheel arch 06 November 2014 [16:18] 06/11/2014 727390014311 727390014311
1 No hazard light switch No hazard light switch 06 November 2014 [16:18] 06/11/2014 727390014311 727390014311
1 Outer sills slightly weak at edges Outer sills slightly weak at edges 02 November 2013 [11:09] 02/11/2013 739426503348 739426503348

MOT TEST: 07 July 2017 13:03:43 PASSED
MOT TEST: 07 July 2017 13:03:43 PASSED

This test (413991671391) was completed on the 07 July 2017 13:03:43 and PASSED the requirements for a valid MOT with 0 comments.

This test (413991671391) was completed on the 07 July 2017 13:03:43 and PASSED the requirements for a valid MOT with 0 comments.

Recorded mileage: 20,163

Recorded mileage: 20,163


MOT TEST: 07 July 2017 12:26:53 FAILED
MOT TEST: 07 July 2017 12:26:53 FAILED

This test (353025194882) was completed on the 07 July 2017 12:26:53 and FAILED the requirements for a valid MOT with 2 comments.

This test (353025194882) was completed on the 07 July 2017 12:26:53 and FAILED the requirements for a valid MOT with 2 comments.

Recorded mileage: 20,163

Recorded mileage: 20,163


FAIL


MOT TEST: 16 June 2016 15:23:43 PASSED
MOT TEST: 16 June 2016 15:23:43 PASSED

This test (537591968544) was completed on the 16 June 2016 15:23:43 and PASSED the requirements for a valid MOT with 1 comments.

This test (537591968544) was completed on the 16 June 2016 15:23:43 and PASSED the requirements for a valid MOT with 1 comments.

Recorded mileage: 20,088

Recorded mileage: 20,088


ADVISORY


MOT TEST: 15 June 2016 12:00:42 FAILED
MOT TEST: 15 June 2016 12:00:42 FAILED

This test (143042877127) was completed on the 15 June 2016 12:00:42 and FAILED the requirements for a valid MOT with 7 comments.

This test (143042877127) was completed on the 15 June 2016 12:00:42 and FAILED the requirements for a valid MOT with 7 comments.

Recorded mileage: 20,088

Recorded mileage: 20,088


ADVISORY

FAIL


MOT TEST: 12 November 2014 10:42:34 PASSED
MOT TEST: 12 November 2014 10:42:34 PASSED

This test (915396714360) was completed on the 12 November 2014 10:42:34 and PASSED the requirements for a valid MOT with 0 comments.

This test (915396714360) was completed on the 12 November 2014 10:42:34 and PASSED the requirements for a valid MOT with 0 comments.

Recorded mileage: 20,008

Recorded mileage: 20,008


MOT TEST: 06 November 2014 16:18:46 FAILED
MOT TEST: 06 November 2014 16:18:46 FAILED

This test (727390014311) was completed on the 06 November 2014 16:18:46 and FAILED the requirements for a valid MOT with 14 comments.

This test (727390014311) was completed on the 06 November 2014 16:18:46 and FAILED the requirements for a valid MOT with 14 comments.

Recorded mileage: 20,008

Recorded mileage: 20,008


FAIL

USER ENTERED


MOT TEST: 02 November 2013 11:09:08 PASSED
MOT TEST: 02 November 2013 11:09:08 PASSED

This test (739426503348) was completed on the 02 November 2013 11:09:08 and PASSED the requirements for a valid MOT with 1 comments.

This test (739426503348) was completed on the 02 November 2013 11:09:08 and PASSED the requirements for a valid MOT with 1 comments.

Recorded mileage: 59,999

Recorded mileage: 59,999


USER ENTERED


MOT TEST: 26 June 2012 15:44:08 PASSED
MOT TEST: 26 June 2012 15:44:08 PASSED

This test (649418372132) was completed on the 26 June 2012 15:44:08 and PASSED the requirements for a valid MOT with 0 comments.

This test (649418372132) was completed on the 26 June 2012 15:44:08 and PASSED the requirements for a valid MOT with 0 comments.

Recorded mileage: 112,162

Recorded mileage: 112,162


MOT TEST: 21 June 2012 14:57:38 FAILED
MOT TEST: 21 June 2012 14:57:38 FAILED

This test (186333572134) was completed on the 21 June 2012 14:57:38 and FAILED the requirements for a valid MOT with 6 comments.

This test (186333572134) was completed on the 21 June 2012 14:57:38 and FAILED the requirements for a valid MOT with 6 comments.

Recorded mileage: 112,162

Recorded mileage: 112,162


FAIL


MOT TEST: 23 October 2010 13:22:09 PASSED
MOT TEST: 23 October 2010 13:22:09 PASSED

This test (114226190282) was completed on the 23 October 2010 13:22:09 and PASSED the requirements for a valid MOT with 2 comments.

This test (114226190282) was completed on the 23 October 2010 13:22:09 and PASSED the requirements for a valid MOT with 2 comments.

Recorded mileage: 111,830

Recorded mileage: 111,830


ADVISORY

USER ENTERED


MOT TEST: 11 October 2010 15:55:11 FAILED
MOT TEST: 11 October 2010 15:55:11 FAILED

This test (294074380296) was completed on the 11 October 2010 15:55:11 and FAILED the requirements for a valid MOT with 10 comments.

This test (294074380296) was completed on the 11 October 2010 15:55:11 and FAILED the requirements for a valid MOT with 10 comments.

Recorded mileage: 111,830

Recorded mileage: 111,830


ADVISORY

FAIL

USER ENTERED


MOT TEST: 21 October 2009 08:17:10 PASSED
MOT TEST: 21 October 2009 08:17:10 PASSED

This test (190934399227) was completed on the 21 October 2009 08:17:10 and PASSED the requirements for a valid MOT with 0 comments.

This test (190934399227) was completed on the 21 October 2009 08:17:10 and PASSED the requirements for a valid MOT with 0 comments.

Recorded mileage: 108,678

Recorded mileage: 108,678


MOT TEST: 19 October 2009 16:47:42 FAILED
MOT TEST: 19 October 2009 16:47:42 FAILED

This test (373382399216) was completed on the 19 October 2009 16:47:42 and FAILED the requirements for a valid MOT with 2 comments.

This test (373382399216) was completed on the 19 October 2009 16:47:42 and FAILED the requirements for a valid MOT with 2 comments.

Recorded mileage: 108,676

Recorded mileage: 108,676


FAIL


MOT TEST: 08 March 2008 09:26:12 PASSED
MOT TEST: 08 March 2008 09:26:12 PASSED

This test (130638468054) was completed on the 08 March 2008 09:26:12 and PASSED the requirements for a valid MOT with 0 comments.

This test (130638468054) was completed on the 08 March 2008 09:26:12 and PASSED the requirements for a valid MOT with 0 comments.

Recorded mileage: 107,133

Recorded mileage: 107,133


MOT TEST: 26 February 2008 10:00:05 FAILED
MOT TEST: 26 February 2008 10:00:05 FAILED

This test (712547558035) was completed on the 26 February 2008 10:00:05 and FAILED the requirements for a valid MOT with 1 comments.

This test (712547558035) was completed on the 26 February 2008 10:00:05 and FAILED the requirements for a valid MOT with 1 comments.

Recorded mileage: 107,091

Recorded mileage: 107,091


FAIL


MOT TEST: 08 May 2007 12:06:11 PASSED
MOT TEST: 08 May 2007 12:06:11 PASSED

This test (150578327165) was completed on the 08 May 2007 12:06:11 and PASSED the requirements for a valid MOT with 0 comments.

This test (150578327165) was completed on the 08 May 2007 12:06:11 and PASSED the requirements for a valid MOT with 0 comments.

Recorded mileage: 106,828

Recorded mileage: 106,828


MOT TEST: 04 April 2006 17:07:06 PASSED
MOT TEST: 04 April 2006 17:07:06 PASSED

This test (142334396067) was completed on the 04 April 2006 17:07:06 and PASSED the requirements for a valid MOT with 0 comments.

This test (142334396067) was completed on the 04 April 2006 17:07:06 and PASSED the requirements for a valid MOT with 0 comments.

Recorded mileage: 78,563

Recorded mileage: 78,563