JUO 592E


JUO592E is registered to a Grey 1967, Morris Minor 1000 with a Petrol engine. It Failed its most recent MOT Test on the 09 June 2017

37 unique faults (52 Total) reported in its MOT History (21 Tests).

11 common/recurring faults, the most frequent (4 times) is: Nearside Upper Steering pivot point has slight play (2.2.B.1g).

57% (12) MOT Pass Rate and a 43% (9) MOT Failure Rate.

166,736 recorded miles.

JUO 592E


JUO592E is registered to a Grey 1967, Morris Minor 1000 with a Petrol engine. It Failed its most recent MOT Test on the 09 June 2017

37 unique faults (52 Total) reported in its MOT History (21 Tests).

11 common/recurring faults, the most frequent (4 times) is: Nearside Upper Steering pivot point has slight play (2.2.B.1g).

57% (12) MOT Pass Rate and a 43% (9) MOT Failure Rate.

166,736 recorded miles.

MOT PASS/Failure rate for JUO 592E

all MOT test results for JUO 592E represented as a percentage
MOT PASS/Failure rate for JUO 592E
all MOT test results for JUO 592E represented as a percentage

PERCENTAGE OF VEHICLE FAULTS WITH JUO 592E

ALL REPORTED FAULTS, DISPLAYED BY PERCENTAGE OF OCCURRENCE DURING ALL MOT TESTS
PERCENTAGE OF VEHICLE FAULTS WITH JUO 592E
ALL REPORTED FAULTS, DISPLAYED BY PERCENTAGE OF OCCURRENCE DURING ALL MOT TESTS
ADVISORY

FAIL

PASS WITH RECTIFICATION

JUO 592E annual Faults by type

ALL REPORTED FAULTS, DISPLAYED over time and categorised by type
JUO 592E annual Faults by type
ALL REPORTED FAULTS, DISPLAYED over time and categorised by type

RECURRING FAULTS WITH JUO 592E

FAULTS THAT HAVE OCCURED MORE THAN ONCE DURING JUO 592E's MOT HISTORY
RECURRING FAULTS WITH JUO 592E
FAULTS THAT HAVE OCCURED MORE THAN ONCE DURING JUO 592E's MOT HISTORY
Fault Fault Test Date Test Date/Time Reference MOT Test Reference
4 Nearside upper steering pivot point has slight play (2.2.b.1g) Nearside upper steering pivot point has slight play (2.2.b.1g) 19 May 2015 [15:59] 19/05/2015 19 May 2015 [14:51] 19/05/2015 19 May 2014 [16:47] 19/05/2014 13 May 2014 [14:57] 13/05/2014 179009435134 179009435134 569219035183 569219035183 118599634185 118599634185 477663034170 477663034170
4 Offside upper steering pivot point has slight play (2.2.b.1g) Offside upper steering pivot point has slight play (2.2.b.1g) 19 May 2015 [15:59] 19/05/2015 19 May 2015 [14:51] 19/05/2015 19 May 2014 [16:47] 19/05/2014 13 May 2014 [14:57] 13/05/2014 179009435134 179009435134 569219035183 569219035183 118599634185 118599634185 477663034170 477663034170
2 Nearside front upper steering pivot point has slight play joint (2.2.b.1g) Nearside front upper steering pivot point has slight play joint (2.2.b.1g) 09 June 2017 [11:32] 09/06/2017 30 May 2017 [13:53] 30/05/2017 922001161015 922001161015 779362576501 779362576501
2 Nearside front upper steering pivot point has slight play bush (2.2.b.1g) Nearside front upper steering pivot point has slight play bush (2.2.b.1g) 09 June 2017 [11:32] 09/06/2017 30 May 2017 [13:53] 30/05/2017 922001161015 922001161015 779362576501 779362576501
2 Offside front wheel bearing has slight play (2.5.a.3c) Offside front wheel bearing has slight play (2.5.a.3c) 09 June 2017 [11:32] 09/06/2017 30 May 2017 [13:53] 30/05/2017 922001161015 922001161015 779362576501 779362576501
2 Rear tyres perished Rear tyres perished 09 June 2017 [11:32] 09/06/2017 30 May 2017 [13:53] 30/05/2017 922001161015 922001161015 779362576501 779362576501
2 Offside rear brake binding (3.7.b.1) Offside rear brake binding (3.7.b.1) 30 May 2017 [13:53] 30/05/2017 23 May 2016 [14:55] 23/05/2016 779362576501 779362576501 303018193093 303018193093
2 Vehicle structure has slight corrosion (6.1.a.1) Vehicle structure has slight corrosion (6.1.a.1) 23 May 2016 [16:01] 23/05/2016 23 May 2016 [14:55] 23/05/2016 593137186708 593137186708 303018193093 303018193093
2 Horn not working (1.6.2a) Horn not working (1.6.2a) 19 May 2015 [14:51] 19/05/2015 13 May 2008 [12:47] 13/05/2008 569219035183 569219035183 842734338165 842734338165
2 Nearside lower steering pivot point has slight play (2.2.b.1g) Nearside lower steering pivot point has slight play (2.2.b.1g) 19 May 2014 [16:47] 19/05/2014 13 May 2014 [14:57] 13/05/2014 118599634185 118599634185 477663034170 477663034170
2 Offside lower steering pivot point has slight play (2.2.b.1g) Offside lower steering pivot point has slight play (2.2.b.1g) 19 May 2014 [16:47] 19/05/2014 13 May 2014 [14:57] 13/05/2014 118599634185 118599634185 477663034170 477663034170

ALL JUO 592E ADVISORIES [22]

ALL ADVISORIES, ORDERED by OCCURRENCE DURING JUO 592E's MOT HISTORY
ALL JUO 592E ADVISORIES [22]
ALL ADVISORIES, ORDERED by OCCURRENCE DURING JUO 592E's MOT HISTORY
Advisory Faults | source www.vehiclestats.co.uk
Fault Fault Test Date Test Date/Time Reference MOT Test Reference
4 Nearside upper steering pivot point has slight play (2.2.b.1g) Nearside upper steering pivot point has slight play (2.2.b.1g) 19 May 2015 [15:59] 19/05/2015 19 May 2015 [14:51] 19/05/2015 19 May 2014 [16:47] 19/05/2014 13 May 2014 [14:57] 13/05/2014 179009435134 179009435134 569219035183 569219035183 118599634185 118599634185 477663034170 477663034170
4 Offside upper steering pivot point has slight play (2.2.b.1g) Offside upper steering pivot point has slight play (2.2.b.1g) 19 May 2015 [15:59] 19/05/2015 19 May 2015 [14:51] 19/05/2015 19 May 2014 [16:47] 19/05/2014 13 May 2014 [14:57] 13/05/2014 179009435134 179009435134 569219035183 569219035183 118599634185 118599634185 477663034170 477663034170
2 Nearside front upper steering pivot point has slight play joint (2.2.b.1g) Nearside front upper steering pivot point has slight play joint (2.2.b.1g) 09 June 2017 [11:32] 09/06/2017 30 May 2017 [13:53] 30/05/2017 922001161015 922001161015 779362576501 779362576501
2 Nearside front upper steering pivot point has slight play bush (2.2.b.1g) Nearside front upper steering pivot point has slight play bush (2.2.b.1g) 09 June 2017 [11:32] 09/06/2017 30 May 2017 [13:53] 30/05/2017 922001161015 922001161015 779362576501 779362576501
2 Offside front wheel bearing has slight play (2.5.a.3c) Offside front wheel bearing has slight play (2.5.a.3c) 09 June 2017 [11:32] 09/06/2017 30 May 2017 [13:53] 30/05/2017 922001161015 922001161015 779362576501 779362576501
2 Rear tyres perished Rear tyres perished 09 June 2017 [11:32] 09/06/2017 30 May 2017 [13:53] 30/05/2017 922001161015 922001161015 779362576501 779362576501
2 Vehicle structure has slight corrosion (6.1.a.1) Vehicle structure has slight corrosion (6.1.a.1) 23 May 2016 [16:01] 23/05/2016 23 May 2016 [14:55] 23/05/2016 593137186708 593137186708 303018193093 303018193093
2 Nearside lower steering pivot point has slight play (2.2.b.1g) Nearside lower steering pivot point has slight play (2.2.b.1g) 19 May 2014 [16:47] 19/05/2014 13 May 2014 [14:57] 13/05/2014 118599634185 118599634185 477663034170 477663034170
2 Offside lower steering pivot point has slight play (2.2.b.1g) Offside lower steering pivot point has slight play (2.2.b.1g) 19 May 2014 [16:47] 19/05/2014 13 May 2014 [14:57] 13/05/2014 118599634185 118599634185 477663034170 477663034170

ALL JUO 592E Failure Faults [24]

ALL Failure faults, ORDERED by OCCURRENCE DURING JUO 592E's MOT HISTORY
ALL JUO 592E Failure Faults [24]
ALL Failure faults, ORDERED by OCCURRENCE DURING JUO 592E's MOT HISTORY
Fail Faults | source www.vehiclestats.co.uk
Fault Fault Test Date Test Date/Time Reference MOT Test Reference
2 Offside rear brake binding (3.7.b.1) Offside rear brake binding (3.7.b.1) 30 May 2017 [13:53] 30/05/2017 23 May 2016 [14:55] 23/05/2016 779362576501 779362576501 303018193093 303018193093
2 Horn not working (1.6.2a) Horn not working (1.6.2a) 19 May 2015 [14:51] 19/05/2015 13 May 2008 [12:47] 13/05/2008 569219035183 569219035183 842734338165 842734338165
1 Nearside rear brake recording little or no effort (3.7.b.5a) Nearside rear brake recording little or no effort (3.7.b.5a) 30 May 2017 [13:53] 30/05/2017 779362576501 779362576501
1 Offside rear brake recording little or no effort (3.7.b.5a) Offside rear brake recording little or no effort (3.7.b.5a) 30 May 2017 [13:53] 30/05/2017 779362576501 779362576501
1 Indicator tell tale inoperative (1.4.a.2a) Indicator tell tale inoperative (1.4.a.2a) 30 May 2017 [13:53] 30/05/2017 779362576501 779362576501
1 Offside headlamp not working on dipped beam (1.7.5a) Offside headlamp not working on dipped beam (1.7.5a) 30 May 2017 [13:53] 30/05/2017 779362576501 779362576501
1 Offside front vehicle structure has excessive corrosion which adversely affects braking or steering floor /lower sill (6.1.a.1) Offside front vehicle structure has excessive corrosion which adversely affects braking or steering floor /lower sill (6.1.a.1) 30 May 2017 [13:53] 30/05/2017 779362576501 779362576501
1 Service brake: efficiency below requirements (3.7.b.7) Service brake: efficiency below requirements (3.7.b.7) 30 May 2017 [13:53] 30/05/2017 779362576501 779362576501
1 Rear brakes imbalanced across an axle axle 2 (3.7.b.5b) Rear brakes imbalanced across an axle axle 2 (3.7.b.5b) 30 May 2017 [13:53] 30/05/2017 779362576501 779362576501
1 Offside rear position lamp(s) incorrect colour (1.1.a.3e) Offside rear position lamp(s) incorrect colour (1.1.a.3e) 13 May 2014 [14:57] 13/05/2014 477663034170 477663034170
1 Offside stop lamp emits other than a steady red light (1.2.1e) Offside stop lamp emits other than a steady red light (1.2.1e) 13 May 2014 [14:57] 13/05/2014 477663034170 477663034170
1 Nearside rear leaf spring has a deteriorated shackle pin rubber bush resulting in excessive movement (2.4.b.2) Nearside rear leaf spring has a deteriorated shackle pin rubber bush resulting in excessive movement (2.4.b.2) 13 May 2014 [14:57] 13/05/2014 477663034170 477663034170
1 Offside rear leaf spring has a deteriorated shackle pin rubber bush resulting in excessive movement (2.4.b.2) Offside rear leaf spring has a deteriorated shackle pin rubber bush resulting in excessive movement (2.4.b.2) 13 May 2014 [14:57] 13/05/2014 477663034170 477663034170
1 Horn control missing (1.6.1) Horn control missing (1.6.1) 13 May 2014 [14:57] 13/05/2014 477663034170 477663034170
1 Nearside rear rear position lamp(s) adversely affected by the operation of another lamp (1.1.a.3f) Nearside rear rear position lamp(s) adversely affected by the operation of another lamp (1.1.a.3f) 29 April 2013 [17:02] 29/04/2013 837609913196 837609913196
1 Offside windscreen wiper does not clear the windscreen effectively (8.2.2) Offside windscreen wiper does not clear the windscreen effectively (8.2.2) 29 April 2013 [17:02] 29/04/2013 837609913196 837609913196
1 Brake pedal has insufficient reserve movement (3.3.a.5) Brake pedal has insufficient reserve movement (3.3.a.5) 16 May 2012 [18:21] 16/05/2012 797897032130 797897032130
1 Nearside rear position lamp(s) excessively deteriorated so that it is not visible from a reasonable distance (1.1.a.3d) Nearside rear position lamp(s) excessively deteriorated so that it is not visible from a reasonable distance (1.1.a.3d) 13 May 2008 [12:47] 13/05/2008 842734338165 842734338165
1 Nearside stop lamp not working (1.2.1b) Nearside stop lamp not working (1.2.1b) 13 May 2008 [12:47] 13/05/2008 842734338165 842734338165
1 Registration plate lamp not working (1.1.5c) Registration plate lamp not working (1.1.5c) 13 May 2008 [12:47] 13/05/2008 842734338165 842734338165
1 Offside front brake binding (3.7.b.1) Offside front brake binding (3.7.b.1) 13 May 2008 [12:47] 13/05/2008 842734338165 842734338165
1 Offside suspension component mounting prescribed area is excessively corroded (2.4.a.3) Offside suspension component mounting prescribed area is excessively corroded (2.4.a.3) 13 May 2008 [12:47] 13/05/2008 842734338165 842734338165

ALL JUO 592E Pass With Rectification Faults [6]

ALL Pass With Rectification faults, ORDERED by OCCURRENCE DURING JUO 592E's MOT HISTORY
ALL JUO 592E Pass With Rectification Faults [6]
ALL Pass With Rectification faults, ORDERED by OCCURRENCE DURING JUO 592E's MOT HISTORY
Pass With Rectification Faults | source www.vehiclestats.co.uk
Fault Fault Test Date Test Date/Time Reference MOT Test Reference
1 Offside front front brake binding (3.7.b.1) Offside front front brake binding (3.7.b.1) 17 May 2007 [08:41] 17/05/2007 492077937185 492077937185
1 Nearside front tyre has a cut in excess of the requirements deep enough to reach the ply or cords (4.1.d.1a) Nearside front tyre has a cut in excess of the requirements deep enough to reach the ply or cords (4.1.d.1a) 17 May 2007 [08:41] 17/05/2007 492077937185 492077937185
1 Offside front tyre has a cut in excess of the requirements deep enough to reach the ply or cords (4.1.d.1a) Offside front tyre has a cut in excess of the requirements deep enough to reach the ply or cords (4.1.d.1a) 17 May 2007 [08:41] 17/05/2007 492077937185 492077937185
1 Front windscreen wiper does not clear the windscreen effectively (8.2.2) Front windscreen wiper does not clear the windscreen effectively (8.2.2) 17 May 2007 [08:41] 17/05/2007 492077937185 492077937185
1 Nearside rear position lamp(s) adversely affected by the operation of another lamp (1.1.a.3f) Nearside rear position lamp(s) adversely affected by the operation of another lamp (1.1.a.3f) 17 May 2006 [18:46] 17/05/2006 141917036147 141917036147
1 Nearside registration plate lamp not working (1.1.5c) Nearside registration plate lamp not working (1.1.5c) 17 May 2006 [18:46] 17/05/2006 141917036147 141917036147

MOT TEST: 09 June 2017 11:32:54 PASSED
MOT TEST: 09 June 2017 11:32:54 PASSED

This test (922001161015) was completed on the 09 June 2017 11:32:54 and PASSED the requirements for a valid MOT with 4 comments.

This test (922001161015) was completed on the 09 June 2017 11:32:54 and PASSED the requirements for a valid MOT with 4 comments.

Recorded mileage: 17,792

Recorded mileage: 17,792


ADVISORY


MOT TEST: 30 May 2017 13:53:34 FAILED
MOT TEST: 30 May 2017 13:53:34 FAILED

This test (779362576501) was completed on the 30 May 2017 13:53:34 and FAILED the requirements for a valid MOT with 12 comments.

This test (779362576501) was completed on the 30 May 2017 13:53:34 and FAILED the requirements for a valid MOT with 12 comments.

Recorded mileage: 17,792

Recorded mileage: 17,792


ADVISORY

FAIL


MOT TEST: 23 May 2016 16:01:25 PASSED
MOT TEST: 23 May 2016 16:01:25 PASSED

This test (593137186708) was completed on the 23 May 2016 16:01:25 and PASSED the requirements for a valid MOT with 1 comments.

This test (593137186708) was completed on the 23 May 2016 16:01:25 and PASSED the requirements for a valid MOT with 1 comments.

Recorded mileage: 17,553

Recorded mileage: 17,553


ADVISORY


MOT TEST: 23 May 2016 14:55:21 FAILED
MOT TEST: 23 May 2016 14:55:21 FAILED

This test (303018193093) was completed on the 23 May 2016 14:55:21 and FAILED the requirements for a valid MOT with 2 comments.

This test (303018193093) was completed on the 23 May 2016 14:55:21 and FAILED the requirements for a valid MOT with 2 comments.

Recorded mileage: 17,553

Recorded mileage: 17,553


ADVISORY

FAIL


MOT TEST: 19 May 2015 15:59:19 PASSED
MOT TEST: 19 May 2015 15:59:19 PASSED

This test (179009435134) was completed on the 19 May 2015 15:59:19 and PASSED the requirements for a valid MOT with 2 comments.

This test (179009435134) was completed on the 19 May 2015 15:59:19 and PASSED the requirements for a valid MOT with 2 comments.

Recorded mileage: 17,357

Recorded mileage: 17,357


ADVISORY


MOT TEST: 19 May 2015 14:51:07 FAILED
MOT TEST: 19 May 2015 14:51:07 FAILED

This test (569219035183) was completed on the 19 May 2015 14:51:07 and FAILED the requirements for a valid MOT with 3 comments.

This test (569219035183) was completed on the 19 May 2015 14:51:07 and FAILED the requirements for a valid MOT with 3 comments.

Recorded mileage: 17,357

Recorded mileage: 17,357


ADVISORY

FAIL


MOT TEST: 19 May 2014 16:47:36 PASSED
MOT TEST: 19 May 2014 16:47:36 PASSED

This test (118599634185) was completed on the 19 May 2014 16:47:36 and PASSED the requirements for a valid MOT with 4 comments.

This test (118599634185) was completed on the 19 May 2014 16:47:36 and PASSED the requirements for a valid MOT with 4 comments.

Recorded mileage: 17,225

Recorded mileage: 17,225


ADVISORY


MOT TEST: 13 May 2014 14:57:43 FAILED
MOT TEST: 13 May 2014 14:57:43 FAILED

This test (477663034170) was completed on the 13 May 2014 14:57:43 and FAILED the requirements for a valid MOT with 9 comments.

This test (477663034170) was completed on the 13 May 2014 14:57:43 and FAILED the requirements for a valid MOT with 9 comments.

Recorded mileage: 17,225

Recorded mileage: 17,225


ADVISORY

FAIL


MOT TEST: 30 April 2013 16:03:46 PASSED
MOT TEST: 30 April 2013 16:03:46 PASSED

This test (248200023434) was completed on the 30 April 2013 16:03:46 and PASSED the requirements for a valid MOT with 0 comments.

This test (248200023434) was completed on the 30 April 2013 16:03:46 and PASSED the requirements for a valid MOT with 0 comments.

Recorded mileage: 16,702

Recorded mileage: 16,702


MOT TEST: 29 April 2013 17:02:20 FAILED
MOT TEST: 29 April 2013 17:02:20 FAILED

This test (837609913196) was completed on the 29 April 2013 17:02:20 and FAILED the requirements for a valid MOT with 2 comments.

This test (837609913196) was completed on the 29 April 2013 17:02:20 and FAILED the requirements for a valid MOT with 2 comments.

Recorded mileage: 16,702

Recorded mileage: 16,702


FAIL


MOT TEST: 22 May 2012 18:03:12 PASSED
MOT TEST: 22 May 2012 18:03:12 PASSED

This test (986183742149) was completed on the 22 May 2012 18:03:12 and PASSED the requirements for a valid MOT with 0 comments.

This test (986183742149) was completed on the 22 May 2012 18:03:12 and PASSED the requirements for a valid MOT with 0 comments.

Recorded mileage: 16,696

Recorded mileage: 16,696


MOT TEST: 16 May 2012 18:21:06 FAILED
MOT TEST: 16 May 2012 18:21:06 FAILED

This test (797897032130) was completed on the 16 May 2012 18:21:06 and FAILED the requirements for a valid MOT with 1 comments.

This test (797897032130) was completed on the 16 May 2012 18:21:06 and FAILED the requirements for a valid MOT with 1 comments.

Recorded mileage: 16,696

Recorded mileage: 16,696


FAIL


MOT TEST: 09 May 2011 18:22:37 PASSED
MOT TEST: 09 May 2011 18:22:37 PASSED

This test (876299621112) was completed on the 09 May 2011 18:22:37 and PASSED the requirements for a valid MOT with 0 comments.

This test (876299621112) was completed on the 09 May 2011 18:22:37 and PASSED the requirements for a valid MOT with 0 comments.

Recorded mileage: 166,736

Recorded mileage: 166,736


MOT TEST: 11 May 2010 11:28:28 PASSED
MOT TEST: 11 May 2010 11:28:28 PASSED

This test (761701730174) was completed on the 11 May 2010 11:28:28 and PASSED the requirements for a valid MOT with 0 comments.

This test (761701730174) was completed on the 11 May 2010 11:28:28 and PASSED the requirements for a valid MOT with 0 comments.

Recorded mileage: 16,661

Recorded mileage: 16,661


MOT TEST: 12 May 2009 10:06:56 PASSED
MOT TEST: 12 May 2009 10:06:56 PASSED

This test (554122739132) was completed on the 12 May 2009 10:06:56 and PASSED the requirements for a valid MOT with 0 comments.

This test (554122739132) was completed on the 12 May 2009 10:06:56 and PASSED the requirements for a valid MOT with 0 comments.

Recorded mileage: 166,314

Recorded mileage: 166,314


MOT TEST: 15 May 2008 17:01:06 PASSED
MOT TEST: 15 May 2008 17:01:06 PASSED

This test (972526638154) was completed on the 15 May 2008 17:01:06 and PASSED the requirements for a valid MOT with 0 comments.

This test (972526638154) was completed on the 15 May 2008 17:01:06 and PASSED the requirements for a valid MOT with 0 comments.

Recorded mileage: 16,158

Recorded mileage: 16,158


MOT TEST: 13 May 2008 12:47:18 FAILED
MOT TEST: 13 May 2008 12:47:18 FAILED

This test (842734338165) was completed on the 13 May 2008 12:47:18 and FAILED the requirements for a valid MOT with 6 comments.

This test (842734338165) was completed on the 13 May 2008 12:47:18 and FAILED the requirements for a valid MOT with 6 comments.

Recorded mileage: 16,157

Recorded mileage: 16,157


FAIL


MOT TEST: 17 May 2007 08:41:35 PASSED
MOT TEST: 17 May 2007 08:41:35 PASSED

This test (823007537139) was completed on the 17 May 2007 08:41:35 and PASSED the requirements for a valid MOT with 0 comments.

This test (823007537139) was completed on the 17 May 2007 08:41:35 and PASSED the requirements for a valid MOT with 0 comments.

Recorded mileage: 16,102

Recorded mileage: 16,102


MOT TEST: 17 May 2007 08:41:35 FAILED
MOT TEST: 17 May 2007 08:41:35 FAILED

This test (492077937185) was completed on the 17 May 2007 08:41:35 and FAILED the requirements for a valid MOT with 4 comments.

This test (492077937185) was completed on the 17 May 2007 08:41:35 and FAILED the requirements for a valid MOT with 4 comments.

Recorded mileage: 16,102

Recorded mileage: 16,102


PASS WITH RECTIFICATION


MOT TEST: 17 May 2006 18:46:02 PASSED
MOT TEST: 17 May 2006 18:46:02 PASSED

This test (284107336170) was completed on the 17 May 2006 18:46:02 and PASSED the requirements for a valid MOT with 0 comments.

This test (284107336170) was completed on the 17 May 2006 18:46:02 and PASSED the requirements for a valid MOT with 0 comments.

Recorded mileage: 16,037

Recorded mileage: 16,037


MOT TEST: 17 May 2006 18:46:02 FAILED
MOT TEST: 17 May 2006 18:46:02 FAILED

This test (141917036147) was completed on the 17 May 2006 18:46:02 and FAILED the requirements for a valid MOT with 2 comments.

This test (141917036147) was completed on the 17 May 2006 18:46:02 and FAILED the requirements for a valid MOT with 2 comments.

Recorded mileage: 16,037

Recorded mileage: 16,037


PASS WITH RECTIFICATION