JUR 630C


JUR630C is registered to a Green 1965, Morris Minor 1000 with a Petrol engine. It Failed its most recent MOT Test on the 20 December 2016

24 unique faults (32 Total) reported in its MOT History (19 Tests).

5 common/recurring faults, the most frequent (3 times) is: Brakes imbalanced across an axle (3.7.B.5b).

63% (12) MOT Pass Rate and a 37% (7) MOT Failure Rate.

74,337 recorded miles.

JUR 630C


JUR630C is registered to a Green 1965, Morris Minor 1000 with a Petrol engine. It Failed its most recent MOT Test on the 20 December 2016

24 unique faults (32 Total) reported in its MOT History (19 Tests).

5 common/recurring faults, the most frequent (3 times) is: Brakes imbalanced across an axle (3.7.B.5b).

63% (12) MOT Pass Rate and a 37% (7) MOT Failure Rate.

74,337 recorded miles.

MOT PASS/Failure rate for JUR 630C

all MOT test results for JUR 630C represented as a percentage
MOT PASS/Failure rate for JUR 630C
all MOT test results for JUR 630C represented as a percentage

PERCENTAGE OF VEHICLE FAULTS WITH JUR 630C

ALL REPORTED FAULTS, DISPLAYED BY PERCENTAGE OF OCCURRENCE DURING ALL MOT TESTS
PERCENTAGE OF VEHICLE FAULTS WITH JUR 630C
ALL REPORTED FAULTS, DISPLAYED BY PERCENTAGE OF OCCURRENCE DURING ALL MOT TESTS
ADVISORY

FAIL

USER ENTERED

JUR 630C annual Faults by type

ALL REPORTED FAULTS, DISPLAYED over time and categorised by type
JUR 630C annual Faults by type
ALL REPORTED FAULTS, DISPLAYED over time and categorised by type

RECURRING FAULTS WITH JUR 630C

FAULTS THAT HAVE OCCURED MORE THAN ONCE DURING JUR 630C's MOT HISTORY
RECURRING FAULTS WITH JUR 630C
FAULTS THAT HAVE OCCURED MORE THAN ONCE DURING JUR 630C's MOT HISTORY
Fault Fault Test Date Test Date/Time Reference MOT Test Reference
3 Brakes imbalanced across an axle (3.7.b.5b) Brakes imbalanced across an axle (3.7.b.5b) 18 December 2015 [09:48] 18/12/2015 10 December 2008 [09:20] 10/12/2008 08 January 2007 [17:06] 08/01/2007 747921515937 747921515937 911965848355 911965848355 320118807066 320118807066
3 Nearside front upper suspension arm rubber bush deteriorated but not resulting in excessive movement (2.4.g.2) Nearside front upper suspension arm rubber bush deteriorated but not resulting in excessive movement (2.4.g.2) 17 December 2014 [12:33] 17/12/2014 17 December 2014 [11:48] 17/12/2014 12 December 2013 [09:44] 12/12/2013 985841254389 985841254389 637781154367 637781154367 306566543394 306566543394
3 Offside front upper suspension arm rubber bush deteriorated but not resulting in excessive movement (2.4.g.2) Offside front upper suspension arm rubber bush deteriorated but not resulting in excessive movement (2.4.g.2) 17 December 2014 [12:33] 17/12/2014 17 December 2014 [11:48] 17/12/2014 12 December 2013 [09:44] 12/12/2013 985841254389 985841254389 637781154367 637781154367 306566543394 306566543394
2 Offside front front wheel bearing has slight play (2.5.a.3c) Offside front front wheel bearing has slight play (2.5.a.3c) 17 December 2014 [12:33] 17/12/2014 17 December 2014 [11:48] 17/12/2014 985841254389 985841254389 637781154367 637781154367
2 Nearside rear shock absorber has a slightly worn linkage (2.7.4) Nearside rear shock absorber has a slightly worn linkage (2.7.4) 12 December 2012 [17:08] 12/12/2012 12 December 2012 [09:34] 12/12/2012 847377642372 847377642372 497527042392 497527042392

ALL JUR 630C ADVISORIES [11]

ALL ADVISORIES, ORDERED by OCCURRENCE DURING JUR 630C's MOT HISTORY
ALL JUR 630C ADVISORIES [11]
ALL ADVISORIES, ORDERED by OCCURRENCE DURING JUR 630C's MOT HISTORY
Advisory Faults | source www.vehiclestats.co.uk
Fault Fault Test Date Test Date/Time Reference MOT Test Reference
3 Nearside front upper suspension arm rubber bush deteriorated but not resulting in excessive movement (2.4.g.2) Nearside front upper suspension arm rubber bush deteriorated but not resulting in excessive movement (2.4.g.2) 17 December 2014 [12:33] 17/12/2014 17 December 2014 [11:48] 17/12/2014 12 December 2013 [09:44] 12/12/2013 985841254389 985841254389 637781154367 637781154367 306566543394 306566543394
3 Offside front upper suspension arm rubber bush deteriorated but not resulting in excessive movement (2.4.g.2) Offside front upper suspension arm rubber bush deteriorated but not resulting in excessive movement (2.4.g.2) 17 December 2014 [12:33] 17/12/2014 17 December 2014 [11:48] 17/12/2014 12 December 2013 [09:44] 12/12/2013 985841254389 985841254389 637781154367 637781154367 306566543394 306566543394
2 Offside front front wheel bearing has slight play (2.5.a.3c) Offside front front wheel bearing has slight play (2.5.a.3c) 17 December 2014 [12:33] 17/12/2014 17 December 2014 [11:48] 17/12/2014 985841254389 985841254389 637781154367 637781154367
2 Nearside rear shock absorber has a slightly worn linkage (2.7.4) Nearside rear shock absorber has a slightly worn linkage (2.7.4) 12 December 2012 [17:08] 12/12/2012 12 December 2012 [09:34] 12/12/2012 847377642372 847377642372 497527042392 497527042392
1 Offside front brake pipe slightly corroded (3.6.b.2c) Offside front brake pipe slightly corroded (3.6.b.2c) 12 December 2007 [10:32] 12/12/2007 534196147392 534196147392

ALL JUR 630C Failure Faults [20]

ALL Failure faults, ORDERED by OCCURRENCE DURING JUR 630C's MOT HISTORY
ALL JUR 630C Failure Faults [20]
ALL Failure faults, ORDERED by OCCURRENCE DURING JUR 630C's MOT HISTORY
Fail Faults | source www.vehiclestats.co.uk
Fault Fault Test Date Test Date/Time Reference MOT Test Reference
3 Brakes imbalanced across an axle (3.7.b.5b) Brakes imbalanced across an axle (3.7.b.5b) 18 December 2015 [09:48] 18/12/2015 10 December 2008 [09:20] 10/12/2008 08 January 2007 [17:06] 08/01/2007 747921515937 747921515937 911965848355 911965848355 320118807066 320118807066
1 Registration plate lamp not working (1.1.c.1d) Registration plate lamp not working (1.1.c.1d) 19 December 2016 [12:03] 19/12/2016 272153543064 272153543064
1 Steering rack insecure anchor brackets movement check bolts tight (2.2.b.1a) Steering rack insecure anchor brackets movement check bolts tight (2.2.b.1a) 19 December 2016 [12:03] 19/12/2016 272153543064 272153543064
1 Nearside front tyre has ply or cords exposed deteriorated (4.1.d.1b) Nearside front tyre has ply or cords exposed deteriorated (4.1.d.1b) 19 December 2016 [12:03] 19/12/2016 272153543064 272153543064
1 Offside rear rear brake recording little or no effort (3.7.b.5a) Offside rear rear brake recording little or no effort (3.7.b.5a) 18 December 2015 [09:48] 18/12/2015 747921515937 747921515937
1 Offside rear rear parking brake recording little or no effort (3.7.b.6a) Offside rear rear parking brake recording little or no effort (3.7.b.6a) 18 December 2015 [09:48] 18/12/2015 747921515937 747921515937
1 Nearside rear rear brake binding (3.7.b.1) Nearside rear rear brake binding (3.7.b.1) 18 December 2015 [09:48] 18/12/2015 747921515937 747921515937
1 Offside rear rear brake binding (3.7.b.1) Offside rear rear brake binding (3.7.b.1) 18 December 2015 [09:48] 18/12/2015 747921515937 747921515937
1 Parking brake: efficiency below requirements (3.7.b.7) Parking brake: efficiency below requirements (3.7.b.7) 18 December 2015 [09:48] 18/12/2015 747921515937 747921515937
1 Rear brakes imbalanced across an axle axle 2 (3.7.b.5b) Rear brakes imbalanced across an axle axle 2 (3.7.b.5b) 18 December 2015 [09:48] 18/12/2015 747921515937 747921515937
1 Nearside front windscreen washer provides insufficient washer liquid (8.2.3) Nearside front windscreen washer provides insufficient washer liquid (8.2.3) 17 December 2014 [11:48] 17/12/2014 637781154367 637781154367
1 Offside front windscreen washer provides insufficient washer liquid (8.2.3) Offside front windscreen washer provides insufficient washer liquid (8.2.3) 17 December 2014 [11:48] 17/12/2014 637781154367 637781154367
1 Nearside front brake hose excessively deteriorated (3.6.b.4d) Nearside front brake hose excessively deteriorated (3.6.b.4d) 12 December 2012 [09:34] 12/12/2012 497527042392 497527042392
1 Nearside stop lamp not working (1.2.1b) Nearside stop lamp not working (1.2.1b) 19 December 2011 [09:05] 19/12/2011 585083551303 585083551303
1 Offside stop lamp not working (1.2.1b) Offside stop lamp not working (1.2.1b) 19 December 2011 [09:05] 19/12/2011 585083551303 585083551303
1 Nearside front brake application uneven (3.7.b.2) Nearside front brake application uneven (3.7.b.2) 10 December 2008 [09:20] 10/12/2008 911965848355 911965848355
1 Offside front brake pipe excessively corroded (3.6.b.2c) Offside front brake pipe excessively corroded (3.6.b.2c) 10 December 2008 [09:20] 10/12/2008 911965848355 911965848355
1 Offside rear braking system leaking (3.6.a.1) Offside rear braking system leaking (3.6.a.1) 08 January 2007 [17:06] 08/01/2007 320118807066 320118807066

ALL JUR 630C User Entered Faults [1]

ALL User Entered faults, ORDERED by OCCURRENCE DURING JUR 630C's MOT HISTORY
ALL JUR 630C User Entered Faults [1]
ALL User Entered faults, ORDERED by OCCURRENCE DURING JUR 630C's MOT HISTORY
Fail Faults | source www.vehiclestats.co.uk
Fault Fault Test Date Test Date/Time Reference MOT Test Reference
1 Unable to carry out roller brake test due to fluid leak Unable to carry out roller brake test due to fluid leak 08 January 2007 [17:06] 08/01/2007 320118807066 320118807066

MOT TEST: 20 December 2016 11:39:00 PASSED
MOT TEST: 20 December 2016 11:39:00 PASSED

This test (276904040350) was completed on the 20 December 2016 11:39:00 and PASSED the requirements for a valid MOT with 0 comments.

This test (276904040350) was completed on the 20 December 2016 11:39:00 and PASSED the requirements for a valid MOT with 0 comments.

Recorded mileage: 74,337

Recorded mileage: 74,337


MOT TEST: 19 December 2016 12:03:25 FAILED
MOT TEST: 19 December 2016 12:03:25 FAILED

This test (272153543064) was completed on the 19 December 2016 12:03:25 and FAILED the requirements for a valid MOT with 3 comments.

This test (272153543064) was completed on the 19 December 2016 12:03:25 and FAILED the requirements for a valid MOT with 3 comments.

Recorded mileage: 74,337

Recorded mileage: 74,337


FAIL


MOT TEST: 22 December 2015 13:18:39 PASSED
MOT TEST: 22 December 2015 13:18:39 PASSED

This test (928727854888) was completed on the 22 December 2015 13:18:39 and PASSED the requirements for a valid MOT with 0 comments.

This test (928727854888) was completed on the 22 December 2015 13:18:39 and PASSED the requirements for a valid MOT with 0 comments.

Recorded mileage: 74,273

Recorded mileage: 74,273


MOT TEST: 18 December 2015 09:48:47 FAILED
MOT TEST: 18 December 2015 09:48:47 FAILED

This test (747921515937) was completed on the 18 December 2015 09:48:47 and FAILED the requirements for a valid MOT with 7 comments.

This test (747921515937) was completed on the 18 December 2015 09:48:47 and FAILED the requirements for a valid MOT with 7 comments.

Recorded mileage: 74,273

Recorded mileage: 74,273


FAIL


MOT TEST: 17 December 2014 12:33:00 PASSED
MOT TEST: 17 December 2014 12:33:00 PASSED

This test (985841254389) was completed on the 17 December 2014 12:33:00 and PASSED the requirements for a valid MOT with 3 comments.

This test (985841254389) was completed on the 17 December 2014 12:33:00 and PASSED the requirements for a valid MOT with 3 comments.

Recorded mileage: 74,176

Recorded mileage: 74,176


ADVISORY


MOT TEST: 17 December 2014 11:48:40 FAILED
MOT TEST: 17 December 2014 11:48:40 FAILED

This test (637781154367) was completed on the 17 December 2014 11:48:40 and FAILED the requirements for a valid MOT with 5 comments.

This test (637781154367) was completed on the 17 December 2014 11:48:40 and FAILED the requirements for a valid MOT with 5 comments.

Recorded mileage: 74,176

Recorded mileage: 74,176


ADVISORY

FAIL


MOT TEST: 12 December 2013 09:44:59 PASSED
MOT TEST: 12 December 2013 09:44:59 PASSED

This test (306566543394) was completed on the 12 December 2013 09:44:59 and PASSED the requirements for a valid MOT with 2 comments.

This test (306566543394) was completed on the 12 December 2013 09:44:59 and PASSED the requirements for a valid MOT with 2 comments.

Recorded mileage: 73,535

Recorded mileage: 73,535


ADVISORY


MOT TEST: 12 December 2012 17:08:15 PASSED
MOT TEST: 12 December 2012 17:08:15 PASSED

This test (847377642372) was completed on the 12 December 2012 17:08:15 and PASSED the requirements for a valid MOT with 1 comments.

This test (847377642372) was completed on the 12 December 2012 17:08:15 and PASSED the requirements for a valid MOT with 1 comments.

Recorded mileage: 69,776

Recorded mileage: 69,776


ADVISORY


MOT TEST: 12 December 2012 09:34:38 FAILED
MOT TEST: 12 December 2012 09:34:38 FAILED

This test (497527042392) was completed on the 12 December 2012 09:34:38 and FAILED the requirements for a valid MOT with 2 comments.

This test (497527042392) was completed on the 12 December 2012 09:34:38 and FAILED the requirements for a valid MOT with 2 comments.

Recorded mileage: 69,776

Recorded mileage: 69,776


ADVISORY

FAIL


MOT TEST: 21 December 2011 16:29:32 PASSED
MOT TEST: 21 December 2011 16:29:32 PASSED

This test (466935551453) was completed on the 21 December 2011 16:29:32 and PASSED the requirements for a valid MOT with 0 comments.

This test (466935551453) was completed on the 21 December 2011 16:29:32 and PASSED the requirements for a valid MOT with 0 comments.

Recorded mileage: 65,457

Recorded mileage: 65,457


MOT TEST: 19 December 2011 09:05:47 FAILED
MOT TEST: 19 December 2011 09:05:47 FAILED

This test (585083551303) was completed on the 19 December 2011 09:05:47 and FAILED the requirements for a valid MOT with 2 comments.

This test (585083551303) was completed on the 19 December 2011 09:05:47 and FAILED the requirements for a valid MOT with 2 comments.

Recorded mileage: 65,432

Recorded mileage: 65,432


FAIL


MOT TEST: 16 December 2010 09:32:14 PASSED
MOT TEST: 16 December 2010 09:32:14 PASSED

This test (413490250419) was completed on the 16 December 2010 09:32:14 and PASSED the requirements for a valid MOT with 0 comments.

This test (413490250419) was completed on the 16 December 2010 09:32:14 and PASSED the requirements for a valid MOT with 0 comments.

Recorded mileage: 59,800

Recorded mileage: 59,800


MOT TEST: 22 December 2009 09:41:06 PASSED
MOT TEST: 22 December 2009 09:41:06 PASSED

This test (533386059390) was completed on the 22 December 2009 09:41:06 and PASSED the requirements for a valid MOT with 0 comments.

This test (533386059390) was completed on the 22 December 2009 09:41:06 and PASSED the requirements for a valid MOT with 0 comments.

Recorded mileage: 54,740

Recorded mileage: 54,740


MOT TEST: 10 December 2008 14:52:05 PASSED
MOT TEST: 10 December 2008 14:52:05 PASSED

This test (823965148396) was completed on the 10 December 2008 14:52:05 and PASSED the requirements for a valid MOT with 0 comments.

This test (823965148396) was completed on the 10 December 2008 14:52:05 and PASSED the requirements for a valid MOT with 0 comments.

Recorded mileage: 48,621

Recorded mileage: 48,621


MOT TEST: 10 December 2008 09:20:04 FAILED
MOT TEST: 10 December 2008 09:20:04 FAILED

This test (911965848355) was completed on the 10 December 2008 09:20:04 and FAILED the requirements for a valid MOT with 3 comments.

This test (911965848355) was completed on the 10 December 2008 09:20:04 and FAILED the requirements for a valid MOT with 3 comments.

Recorded mileage: 48,620

Recorded mileage: 48,620


FAIL


MOT TEST: 12 December 2007 10:32:52 PASSED
MOT TEST: 12 December 2007 10:32:52 PASSED

This test (534196147392) was completed on the 12 December 2007 10:32:52 and PASSED the requirements for a valid MOT with 1 comments.

This test (534196147392) was completed on the 12 December 2007 10:32:52 and PASSED the requirements for a valid MOT with 1 comments.

Recorded mileage: 45,863

Recorded mileage: 45,863


ADVISORY


MOT TEST: 10 January 2007 16:38:41 PASSED
MOT TEST: 10 January 2007 16:38:41 PASSED

This test (800270717068) was completed on the 10 January 2007 16:38:41 and PASSED the requirements for a valid MOT with 0 comments.

This test (800270717068) was completed on the 10 January 2007 16:38:41 and PASSED the requirements for a valid MOT with 0 comments.

Recorded mileage: 43,926

Recorded mileage: 43,926


MOT TEST: 08 January 2007 17:06:51 FAILED
MOT TEST: 08 January 2007 17:06:51 FAILED

This test (320118807066) was completed on the 08 January 2007 17:06:51 and FAILED the requirements for a valid MOT with 3 comments.

This test (320118807066) was completed on the 08 January 2007 17:06:51 and FAILED the requirements for a valid MOT with 3 comments.

Recorded mileage: 43,923

Recorded mileage: 43,923


FAIL

USER ENTERED


MOT TEST: 12 December 2005 09:11:56 PASSED
MOT TEST: 12 December 2005 09:11:56 PASSED

This test (842026545376) was completed on the 12 December 2005 09:11:56 and PASSED the requirements for a valid MOT with 0 comments.

This test (842026545376) was completed on the 12 December 2005 09:11:56 and PASSED the requirements for a valid MOT with 0 comments.

Recorded mileage: 41,772

Recorded mileage: 41,772