JVE 775F


JVE775F is registered to a White 1968, Morris 1100 with a Petrol engine. It Passed its most recent MOT Test on the 17 September 2018

48 unique faults (74 Total) reported in its MOT History (23 Tests).

14 common/recurring faults, the most frequent (4 times) is: Oil leak.

61% (14) MOT Pass Rate and a 39% (9) MOT Failure Rate.

48,748 recorded miles.

JVE 775F


JVE775F is registered to a White 1968, Morris 1100 with a Petrol engine. It Passed its most recent MOT Test on the 17 September 2018

48 unique faults (74 Total) reported in its MOT History (23 Tests).

14 common/recurring faults, the most frequent (4 times) is: Oil leak.

61% (14) MOT Pass Rate and a 39% (9) MOT Failure Rate.

48,748 recorded miles.

MOT PASS/Failure rate for JVE 775F

all MOT test results for JVE 775F represented as a percentage
MOT PASS/Failure rate for JVE 775F
all MOT test results for JVE 775F represented as a percentage

PERCENTAGE OF VEHICLE FAULTS WITH JVE 775F

ALL REPORTED FAULTS, DISPLAYED BY PERCENTAGE OF OCCURRENCE DURING ALL MOT TESTS
PERCENTAGE OF VEHICLE FAULTS WITH JVE 775F
ALL REPORTED FAULTS, DISPLAYED BY PERCENTAGE OF OCCURRENCE DURING ALL MOT TESTS
ADVISORY

FAIL

USER ENTERED

PASS WITH RECTIFICATION

JVE 775F annual Faults by type

ALL REPORTED FAULTS, DISPLAYED over time and categorised by type
JVE 775F annual Faults by type
ALL REPORTED FAULTS, DISPLAYED over time and categorised by type

RECURRING FAULTS WITH JVE 775F

FAULTS THAT HAVE OCCURED MORE THAN ONCE DURING JVE 775F's MOT HISTORY
RECURRING FAULTS WITH JVE 775F
FAULTS THAT HAVE OCCURED MORE THAN ONCE DURING JVE 775F's MOT HISTORY
Fault Fault Test Date Test Date/Time Reference MOT Test Reference
4 Oil leak Oil leak 26 September 2014 [11:43] 26/09/2014 25 September 2014 [11:01] 25/09/2014 09 September 2014 [12:15] 09/09/2014 12 September 2007 [12:07] 12/09/2007 276869764283 276869764283 107018164279 107018164279 505412054206 505412054206 700605957218 700605957218
3 Nearside front torque/reaction arm has a slightly deteriorated rubber mounting (2.4.g.2) Nearside front torque/reaction arm has a slightly deteriorated rubber mounting (2.4.g.2) 26 September 2014 [11:43] 26/09/2014 25 September 2014 [11:01] 25/09/2014 09 September 2014 [12:15] 09/09/2014 276869764283 276869764283 107018164279 107018164279 505412054206 505412054206
3 No fog lamp tell tale No fog lamp tell tale 26 September 2014 [11:43] 26/09/2014 25 September 2014 [11:01] 25/09/2014 09 September 2014 [12:15] 09/09/2014 276869764283 276869764283 107018164279 107018164279 505412054206 505412054206
3 Nearside rear suspension component mounting prescribed area is excessively corroded (2.4.a.3) Nearside rear suspension component mounting prescribed area is excessively corroded (2.4.a.3) 25 September 2014 [11:01] 25/09/2014 09 September 2014 [12:15] 09/09/2014 15 September 2008 [13:01] 15/09/2008 107018164279 107018164279 505412054206 505412054206 351639058288 351639058288
3 Nearside rear seat belt anchorage prescribed area is excessively corroded (5.2.6) Nearside rear seat belt anchorage prescribed area is excessively corroded (5.2.6) 25 September 2014 [11:01] 25/09/2014 09 September 2014 [12:15] 09/09/2014 15 September 2008 [13:01] 15/09/2008 107018164279 107018164279 505412054206 505412054206 351639058288 351639058288
2 Both front bump stops missing. Both front bump stops missing. 30 September 2015 [10:48] 30/09/2015 30 September 2015 [10:48] 30/09/2015 713196753925 713196753925 243883923927 243883923927
2 One rear bump stop missing. One rear bump stop missing. 30 September 2015 [10:48] 30/09/2015 30 September 2015 [10:48] 30/09/2015 713196753925 713196753925 243883923927 243883923927
2 Front stabiliser bar bushes required soon. Front stabiliser bar bushes required soon. 30 September 2015 [10:48] 30/09/2015 30 September 2015 [10:48] 30/09/2015 713196753925 713196753925 243883923927 243883923927
2 Offside steering rack gaiter deteriorated (2.2.d.2d) Offside steering rack gaiter deteriorated (2.2.d.2d) 26 September 2014 [11:43] 26/09/2014 25 September 2014 [11:01] 25/09/2014 276869764283 276869764283 107018164279 107018164279
2 Front suspension bushes deteriorating but none have excesive play Front suspension bushes deteriorating but none have excesive play 26 September 2014 [11:43] 26/09/2014 25 September 2014 [11:01] 25/09/2014 276869764283 276869764283 107018164279 107018164279
2 Offside front suspension component mounting prescribed area is excessively corroded (2.4.a.3) Offside front suspension component mounting prescribed area is excessively corroded (2.4.a.3) 09 September 2014 [12:15] 09/09/2014 15 September 2008 [13:01] 15/09/2008 505412054206 505412054206 351639058288 351639058288
2 Nearside front suspension component mounting prescribed area is excessively corroded (2.4.a.3) Nearside front suspension component mounting prescribed area is excessively corroded (2.4.a.3) 09 September 2014 [12:15] 09/09/2014 15 September 2008 [13:01] 15/09/2008 505412054206 505412054206 351639058288 351639058288
2 Brakes imbalanced across an axle (3.7.b.5b) Brakes imbalanced across an axle (3.7.b.5b) 23 September 2013 [17:34] 23/09/2013 22 September 2010 [12:02] 22/09/2010 608286163248 608286163248 581905960203 581905960203
2 Rear seatbelts- old design! Rear seatbelts- old design! 25 September 2008 [13:27] 25/09/2008 15 September 2008 [13:01] 15/09/2008 232219768213 232219768213 351639058288 351639058288

ALL JVE 775F ADVISORIES [13]

ALL ADVISORIES, ORDERED by OCCURRENCE DURING JVE 775F's MOT HISTORY
ALL JVE 775F ADVISORIES [13]
ALL ADVISORIES, ORDERED by OCCURRENCE DURING JVE 775F's MOT HISTORY
Advisory Faults | source www.vehiclestats.co.uk
Fault Fault Test Date Test Date/Time Reference MOT Test Reference
3 Nearside front torque/reaction arm has a slightly deteriorated rubber mounting (2.4.g.2) Nearside front torque/reaction arm has a slightly deteriorated rubber mounting (2.4.g.2) 26 September 2014 [11:43] 26/09/2014 25 September 2014 [11:01] 25/09/2014 09 September 2014 [12:15] 09/09/2014 276869764283 276869764283 107018164279 107018164279 505412054206 505412054206
2 Both front bump stops missing. Both front bump stops missing. 30 September 2015 [10:48] 30/09/2015 30 September 2015 [10:48] 30/09/2015 713196753925 713196753925 243883923927 243883923927
2 One rear bump stop missing. One rear bump stop missing. 30 September 2015 [10:48] 30/09/2015 30 September 2015 [10:48] 30/09/2015 713196753925 713196753925 243883923927 243883923927
2 Front stabiliser bar bushes required soon. Front stabiliser bar bushes required soon. 30 September 2015 [10:48] 30/09/2015 30 September 2015 [10:48] 30/09/2015 713196753925 713196753925 243883923927 243883923927
2 Offside steering rack gaiter deteriorated (2.2.d.2d) Offside steering rack gaiter deteriorated (2.2.d.2d) 26 September 2014 [11:43] 26/09/2014 25 September 2014 [11:01] 25/09/2014 276869764283 276869764283 107018164279 107018164279
1 Nearside inner front road wheel with a slightly distorted bead rim (4.2.a.1a) Nearside inner front road wheel with a slightly distorted bead rim (4.2.a.1a) 15 September 2008 [13:01] 15/09/2008 351639058288 351639058288
1 Exhaust has part of the system slightly deteriorated (7.1.1a) Exhaust has part of the system slightly deteriorated (7.1.1a) 12 September 2007 [12:07] 12/09/2007 700605957218 700605957218

ALL JVE 775F Failure Faults [35]

ALL Failure faults, ORDERED by OCCURRENCE DURING JVE 775F's MOT HISTORY
ALL JVE 775F Failure Faults [35]
ALL Failure faults, ORDERED by OCCURRENCE DURING JVE 775F's MOT HISTORY
Fail Faults | source www.vehiclestats.co.uk
Fault Fault Test Date Test Date/Time Reference MOT Test Reference
3 Nearside rear suspension component mounting prescribed area is excessively corroded (2.4.a.3) Nearside rear suspension component mounting prescribed area is excessively corroded (2.4.a.3) 25 September 2014 [11:01] 25/09/2014 09 September 2014 [12:15] 09/09/2014 15 September 2008 [13:01] 15/09/2008 107018164279 107018164279 505412054206 505412054206 351639058288 351639058288
3 Nearside rear seat belt anchorage prescribed area is excessively corroded (5.2.6) Nearside rear seat belt anchorage prescribed area is excessively corroded (5.2.6) 25 September 2014 [11:01] 25/09/2014 09 September 2014 [12:15] 09/09/2014 15 September 2008 [13:01] 15/09/2008 107018164279 107018164279 505412054206 505412054206 351639058288 351639058288
2 Offside front suspension component mounting prescribed area is excessively corroded (2.4.a.3) Offside front suspension component mounting prescribed area is excessively corroded (2.4.a.3) 09 September 2014 [12:15] 09/09/2014 15 September 2008 [13:01] 15/09/2008 505412054206 505412054206 351639058288 351639058288
2 Nearside front suspension component mounting prescribed area is excessively corroded (2.4.a.3) Nearside front suspension component mounting prescribed area is excessively corroded (2.4.a.3) 09 September 2014 [12:15] 09/09/2014 15 September 2008 [13:01] 15/09/2008 505412054206 505412054206 351639058288 351639058288
2 Brakes imbalanced across an axle (3.7.b.5b) Brakes imbalanced across an axle (3.7.b.5b) 23 September 2013 [17:34] 23/09/2013 22 September 2010 [12:02] 22/09/2010 608286163248 608286163248 581905960203 581905960203
1 Windscreen washer provides insufficient washer liquid (8.2.3) Windscreen washer provides insufficient washer liquid (8.2.3) 09 September 2014 [12:15] 09/09/2014 505412054206 505412054206
1 Nearside front seat belt anchorage prescribed area is excessively corroded (5.2.6) Nearside front seat belt anchorage prescribed area is excessively corroded (5.2.6) 09 September 2014 [12:15] 09/09/2014 505412054206 505412054206
1 Nearside steering rack gaiter split (2.2.d.2d) Nearside steering rack gaiter split (2.2.d.2d) 09 September 2014 [12:15] 09/09/2014 505412054206 505412054206
1 Front exhaust has a major leak of exhaust gases (7.1.2) Front exhaust has a major leak of exhaust gases (7.1.2) 23 September 2013 [17:34] 23/09/2013 608286163248 608286163248
1 Exhaust system not adequately supported (7.1.1) Exhaust system not adequately supported (7.1.1) 23 September 2013 [17:34] 23/09/2013 608286163248 608286163248
1 Nearside headlamp aim too high (1.8) Nearside headlamp aim too high (1.8) 23 September 2013 [17:34] 23/09/2013 608286163248 608286163248
1 Nearside rear tyre has ply or cords exposed (4.1.d.1b) Nearside rear tyre has ply or cords exposed (4.1.d.1b) 23 September 2013 [17:34] 23/09/2013 608286163248 608286163248
1 Nearside front brake binding (3.7.b.1) Nearside front brake binding (3.7.b.1) 22 September 2010 [12:02] 22/09/2010 581905960203 581905960203
1 Nearside rear brake binding (3.7.b.1) Nearside rear brake binding (3.7.b.1) 22 September 2010 [12:02] 22/09/2010 581905960203 581905960203
1 Offside front brake recording little or no effort (3.7.b.5a) Offside front brake recording little or no effort (3.7.b.5a) 15 September 2008 [13:01] 15/09/2008 351639058288 351639058288
1 Offside outer rear suspension component mounting prescribed area is excessively corroded (2.4.a.3) Offside outer rear suspension component mounting prescribed area is excessively corroded (2.4.a.3) 15 September 2008 [13:01] 15/09/2008 351639058288 351639058288
1 Offside inner rear suspension component mounting prescribed area is excessively corroded (2.4.a.3) Offside inner rear suspension component mounting prescribed area is excessively corroded (2.4.a.3) 15 September 2008 [13:01] 15/09/2008 351639058288 351639058288
1 Offside rear suspension component mounting prescribed area is excessively corroded (2.4.a.3) Offside rear suspension component mounting prescribed area is excessively corroded (2.4.a.3) 15 September 2008 [13:01] 15/09/2008 351639058288 351639058288
1 Offside rear seat belt anchorage prescribed area is excessively corroded (5.2.6) Offside rear seat belt anchorage prescribed area is excessively corroded (5.2.6) 15 September 2008 [13:01] 15/09/2008 351639058288 351639058288
1 Offside front brake master cylinder/servo mounting prescribed area is excessively corroded (3.6.c.3) Offside front brake master cylinder/servo mounting prescribed area is excessively corroded (3.6.c.3) 15 September 2008 [13:01] 15/09/2008 351639058288 351639058288
1 Nearside front front position lamp(s) not working (1.1.a.3b) Nearside front front position lamp(s) not working (1.1.a.3b) 09 August 2005 [15:38] 09/08/2005 252611925247 252611925247
1 Nearside rear suspension spring mounting prescribed area is excessively corroded (2.4.a.3) Nearside rear suspension spring mounting prescribed area is excessively corroded (2.4.a.3) 09 August 2005 [15:38] 09/08/2005 252611925247 252611925247

ALL JVE 775F User Entered Faults [20]

ALL User Entered faults, ORDERED by OCCURRENCE DURING JVE 775F's MOT HISTORY
ALL JVE 775F User Entered Faults [20]
ALL User Entered faults, ORDERED by OCCURRENCE DURING JVE 775F's MOT HISTORY
Advisory Faults | source www.vehiclestats.co.uk
Fault Fault Test Date Test Date/Time Reference MOT Test Reference
4 Oil leak Oil leak 26 September 2014 [11:43] 26/09/2014 25 September 2014 [11:01] 25/09/2014 09 September 2014 [12:15] 09/09/2014 12 September 2007 [12:07] 12/09/2007 276869764283 276869764283 107018164279 107018164279 505412054206 505412054206 700605957218 700605957218
3 No fog lamp tell tale No fog lamp tell tale 26 September 2014 [11:43] 26/09/2014 25 September 2014 [11:01] 25/09/2014 09 September 2014 [12:15] 09/09/2014 276869764283 276869764283 107018164279 107018164279 505412054206 505412054206
2 Front suspension bushes deteriorating but none have excesive play Front suspension bushes deteriorating but none have excesive play 26 September 2014 [11:43] 26/09/2014 25 September 2014 [11:01] 25/09/2014 276869764283 276869764283 107018164279 107018164279
2 Rear seatbelts- old design! Rear seatbelts- old design! 25 September 2008 [13:27] 25/09/2008 15 September 2008 [13:01] 15/09/2008 232219768213 232219768213 351639058288 351639058288
1 Front suspension bushes deteriorating but none have excess play Front suspension bushes deteriorating but none have excess play 09 September 2014 [12:15] 09/09/2014 505412054206 505412054206
1 Previous welding repairs poor/ covered in under seal Previous welding repairs poor/ covered in under seal 22 September 2009 [12:10] 22/09/2009 284185369242 284185369242
1 Underside of vehicle corroded Underside of vehicle corroded 12 September 2007 [12:07] 12/09/2007 700605957218 700605957218
1 Front brake hose ferrules slightly corroded Front brake hose ferrules slightly corroded 12 September 2007 [12:07] 12/09/2007 700605957218 700605957218
1 N/s/r brake binding slightly N/s/r brake binding slightly 12 September 2007 [12:07] 12/09/2007 700605957218 700605957218
1 Rear diff noisy when rear wheels spun Rear diff noisy when rear wheels spun 12 September 2007 [12:07] 12/09/2007 700605957218 700605957218
1 Engine/gearbox mounting(s) defective Engine/gearbox mounting(s) defective 09 August 2005 [15:38] 09/08/2005 252611925247 252611925247
1 Nearside front tyre worn on inside edge Nearside front tyre worn on inside edge 09 August 2005 [15:38] 09/08/2005 252611925247 252611925247
1 Rear fog lamp fitted [but inoperative] Rear fog lamp fitted [but inoperative] 09 August 2005 [15:38] 09/08/2005 252611925247 252611925247

ALL JVE 775F Pass With Rectification Faults [6]

ALL Pass With Rectification faults, ORDERED by OCCURRENCE DURING JVE 775F's MOT HISTORY
ALL JVE 775F Pass With Rectification Faults [6]
ALL Pass With Rectification faults, ORDERED by OCCURRENCE DURING JVE 775F's MOT HISTORY
Pass With Rectification Faults | source www.vehiclestats.co.uk
Fault Fault Test Date Test Date/Time Reference MOT Test Reference
1 Offside steering rack gaiter split (2.2.d.2d) Offside steering rack gaiter split (2.2.d.2d) 06 September 2016 [14:19] 06/09/2016 869299128273 869299128273
1 Nearside steering rack gaiter insecure (2.2.d.2d) Nearside steering rack gaiter insecure (2.2.d.2d) 06 September 2016 [14:19] 06/09/2016 869299128273 869299128273
1 Nearside track rod end ball joint dust cover excessively damaged so that it no longer prevents the ingress of dirt (2.2.c.1c) Nearside track rod end ball joint dust cover excessively damaged so that it no longer prevents the ingress of dirt (2.2.c.1c) 06 September 2016 [14:19] 06/09/2016 869299128273 869299128273
1 Offside track rod end ball joint dust cover excessively damaged so that it no longer prevents the ingress of dirt (2.2.c.1c) Offside track rod end ball joint dust cover excessively damaged so that it no longer prevents the ingress of dirt (2.2.c.1c) 06 September 2016 [14:19] 06/09/2016 869299128273 869299128273
1 Rear fuel hose leaking (7.2.3) Rear fuel hose leaking (7.2.3) 30 September 2015 [10:48] 30/09/2015 243883923927 243883923927
1 Exhaust has a major leak of exhaust gases (7.1.2) Exhaust has a major leak of exhaust gases (7.1.2) 14 September 2011 [14:59] 14/09/2011 489527251232 489527251232

MOT TEST: 17 September 2018 09:13:22 PASSED
MOT TEST: 17 September 2018 09:13:22 PASSED

This test (902240550445) was completed on the 17 September 2018 09:13:22 and PASSED the requirements for a valid MOT with 0 comments.

This test (902240550445) was completed on the 17 September 2018 09:13:22 and PASSED the requirements for a valid MOT with 0 comments.

Recorded mileage: 48,748

Recorded mileage: 48,748


MOT TEST: 08 September 2017 10:09:22 PASSED
MOT TEST: 08 September 2017 10:09:22 PASSED

This test (762811756582) was completed on the 08 September 2017 10:09:22 and PASSED the requirements for a valid MOT with 0 comments.

This test (762811756582) was completed on the 08 September 2017 10:09:22 and PASSED the requirements for a valid MOT with 0 comments.

Recorded mileage: 48,312

Recorded mileage: 48,312


MOT TEST: 06 September 2016 14:19:03 PASSED
MOT TEST: 06 September 2016 14:19:03 PASSED

This test (111434584753) was completed on the 06 September 2016 14:19:03 and PASSED the requirements for a valid MOT with 0 comments.

This test (111434584753) was completed on the 06 September 2016 14:19:03 and PASSED the requirements for a valid MOT with 0 comments.

Recorded mileage: 47,811

Recorded mileage: 47,811


MOT TEST: 06 September 2016 14:19:02 FAILED
MOT TEST: 06 September 2016 14:19:02 FAILED

This test (869299128273) was completed on the 06 September 2016 14:19:02 and FAILED the requirements for a valid MOT with 4 comments.

This test (869299128273) was completed on the 06 September 2016 14:19:02 and FAILED the requirements for a valid MOT with 4 comments.

Recorded mileage: 47,811

Recorded mileage: 47,811


PASS WITH RECTIFICATION


MOT TEST: 30 September 2015 10:48:01 PASSED
MOT TEST: 30 September 2015 10:48:01 PASSED

This test (713196753925) was completed on the 30 September 2015 10:48:01 and PASSED the requirements for a valid MOT with 3 comments.

This test (713196753925) was completed on the 30 September 2015 10:48:01 and PASSED the requirements for a valid MOT with 3 comments.

Recorded mileage: 46,965

Recorded mileage: 46,965


ADVISORY


MOT TEST: 30 September 2015 10:48:00 FAILED
MOT TEST: 30 September 2015 10:48:00 FAILED

This test (243883923927) was completed on the 30 September 2015 10:48:00 and FAILED the requirements for a valid MOT with 4 comments.

This test (243883923927) was completed on the 30 September 2015 10:48:00 and FAILED the requirements for a valid MOT with 4 comments.

Recorded mileage: 46,965

Recorded mileage: 46,965


ADVISORY

PASS WITH RECTIFICATION


MOT TEST: 26 September 2014 11:43:22 PASSED
MOT TEST: 26 September 2014 11:43:22 PASSED

This test (276869764283) was completed on the 26 September 2014 11:43:22 and PASSED the requirements for a valid MOT with 5 comments.

This test (276869764283) was completed on the 26 September 2014 11:43:22 and PASSED the requirements for a valid MOT with 5 comments.

Recorded mileage: 46,694

Recorded mileage: 46,694


ADVISORY

USER ENTERED


MOT TEST: 25 September 2014 11:01:11 FAILED
MOT TEST: 25 September 2014 11:01:11 FAILED

This test (107018164279) was completed on the 25 September 2014 11:01:11 and FAILED the requirements for a valid MOT with 7 comments.

This test (107018164279) was completed on the 25 September 2014 11:01:11 and FAILED the requirements for a valid MOT with 7 comments.

Recorded mileage: 46,694

Recorded mileage: 46,694


ADVISORY

FAIL

USER ENTERED


MOT TEST: 09 September 2014 12:15:00 FAILED
MOT TEST: 09 September 2014 12:15:00 FAILED

This test (505412054206) was completed on the 09 September 2014 12:15:00 and FAILED the requirements for a valid MOT with 11 comments.

This test (505412054206) was completed on the 09 September 2014 12:15:00 and FAILED the requirements for a valid MOT with 11 comments.

Recorded mileage: 46,692

Recorded mileage: 46,692


ADVISORY

FAIL

USER ENTERED


MOT TEST: 02 October 2013 11:27:27 PASSED
MOT TEST: 02 October 2013 11:27:27 PASSED

This test (527155973219) was completed on the 02 October 2013 11:27:27 and PASSED the requirements for a valid MOT with 0 comments.

This test (527155973219) was completed on the 02 October 2013 11:27:27 and PASSED the requirements for a valid MOT with 0 comments.

Recorded mileage: 46,286

Recorded mileage: 46,286


MOT TEST: 23 September 2013 17:34:23 FAILED
MOT TEST: 23 September 2013 17:34:23 FAILED

This test (608286163248) was completed on the 23 September 2013 17:34:23 and FAILED the requirements for a valid MOT with 5 comments.

This test (608286163248) was completed on the 23 September 2013 17:34:23 and FAILED the requirements for a valid MOT with 5 comments.

Recorded mileage: 46,277

Recorded mileage: 46,277


FAIL


MOT TEST: 25 September 2012 14:35:36 PASSED
MOT TEST: 25 September 2012 14:35:36 PASSED

This test (997569962277) was completed on the 25 September 2012 14:35:36 and PASSED the requirements for a valid MOT with 0 comments.

This test (997569962277) was completed on the 25 September 2012 14:35:36 and PASSED the requirements for a valid MOT with 0 comments.

Recorded mileage: 45,452

Recorded mileage: 45,452


MOT TEST: 14 September 2011 14:59:39 PASSED
MOT TEST: 14 September 2011 14:59:39 PASSED

This test (667397151225) was completed on the 14 September 2011 14:59:39 and PASSED the requirements for a valid MOT with 0 comments.

This test (667397151225) was completed on the 14 September 2011 14:59:39 and PASSED the requirements for a valid MOT with 0 comments.

Recorded mileage: 45,131

Recorded mileage: 45,131


MOT TEST: 14 September 2011 14:59:39 FAILED
MOT TEST: 14 September 2011 14:59:39 FAILED

This test (489527251232) was completed on the 14 September 2011 14:59:39 and FAILED the requirements for a valid MOT with 1 comments.

This test (489527251232) was completed on the 14 September 2011 14:59:39 and FAILED the requirements for a valid MOT with 1 comments.

Recorded mileage: 45,131

Recorded mileage: 45,131


PASS WITH RECTIFICATION


MOT TEST: 04 October 2010 14:28:25 PASSED
MOT TEST: 04 October 2010 14:28:25 PASSED

This test (930467570218) was completed on the 04 October 2010 14:28:25 and PASSED the requirements for a valid MOT with 0 comments.

This test (930467570218) was completed on the 04 October 2010 14:28:25 and PASSED the requirements for a valid MOT with 0 comments.

Recorded mileage: 44,753

Recorded mileage: 44,753


MOT TEST: 22 September 2010 12:02:37 FAILED
MOT TEST: 22 September 2010 12:02:37 FAILED

This test (581905960203) was completed on the 22 September 2010 12:02:37 and FAILED the requirements for a valid MOT with 3 comments.

This test (581905960203) was completed on the 22 September 2010 12:02:37 and FAILED the requirements for a valid MOT with 3 comments.

Recorded mileage: 44,751

Recorded mileage: 44,751


FAIL


MOT TEST: 22 September 2009 12:10:49 PASSED
MOT TEST: 22 September 2009 12:10:49 PASSED

This test (284185369242) was completed on the 22 September 2009 12:10:49 and PASSED the requirements for a valid MOT with 1 comments.

This test (284185369242) was completed on the 22 September 2009 12:10:49 and PASSED the requirements for a valid MOT with 1 comments.

Recorded mileage: 44,518

Recorded mileage: 44,518


USER ENTERED


MOT TEST: 25 September 2008 13:27:54 PASSED
MOT TEST: 25 September 2008 13:27:54 PASSED

This test (232219768213) was completed on the 25 September 2008 13:27:54 and PASSED the requirements for a valid MOT with 1 comments.

This test (232219768213) was completed on the 25 September 2008 13:27:54 and PASSED the requirements for a valid MOT with 1 comments.

Recorded mileage: 44,332

Recorded mileage: 44,332


USER ENTERED


MOT TEST: 15 September 2008 13:01:44 FAILED
MOT TEST: 15 September 2008 13:01:44 FAILED

This test (351639058288) was completed on the 15 September 2008 13:01:44 and FAILED the requirements for a valid MOT with 18 comments.

This test (351639058288) was completed on the 15 September 2008 13:01:44 and FAILED the requirements for a valid MOT with 18 comments.

Recorded mileage: 44,332

Recorded mileage: 44,332


ADVISORY

FAIL

USER ENTERED


MOT TEST: 12 September 2007 12:07:18 PASSED
MOT TEST: 12 September 2007 12:07:18 PASSED

This test (700605957218) was completed on the 12 September 2007 12:07:18 and PASSED the requirements for a valid MOT with 6 comments.

This test (700605957218) was completed on the 12 September 2007 12:07:18 and PASSED the requirements for a valid MOT with 6 comments.

Recorded mileage: 43,994

Recorded mileage: 43,994


ADVISORY

USER ENTERED


MOT TEST: 16 August 2006 11:13:04 PASSED
MOT TEST: 16 August 2006 11:13:04 PASSED

This test (300798526497) was completed on the 16 August 2006 11:13:04 and PASSED the requirements for a valid MOT with 0 comments.

This test (300798526497) was completed on the 16 August 2006 11:13:04 and PASSED the requirements for a valid MOT with 0 comments.

Recorded mileage: 43,507

Recorded mileage: 43,507


MOT TEST: 11 August 2005 15:58:16 PASSED
MOT TEST: 11 August 2005 15:58:16 PASSED

This test (624383025263) was completed on the 11 August 2005 15:58:16 and PASSED the requirements for a valid MOT with 0 comments.

This test (624383025263) was completed on the 11 August 2005 15:58:16 and PASSED the requirements for a valid MOT with 0 comments.

Recorded mileage: 42,902

Recorded mileage: 42,902


MOT TEST: 09 August 2005 15:38:04 FAILED
MOT TEST: 09 August 2005 15:38:04 FAILED

This test (252611925247) was completed on the 09 August 2005 15:38:04 and FAILED the requirements for a valid MOT with 5 comments.

This test (252611925247) was completed on the 09 August 2005 15:38:04 and FAILED the requirements for a valid MOT with 5 comments.

Recorded mileage: 42,888

Recorded mileage: 42,888


FAIL

USER ENTERED