JVF 811D


JVF811D is registered to a Blue 1966, Morris Minor 1000 with a Petrol engine. It Passed its most recent MOT Test on the 07 August 2018

37 unique faults (42 Total) reported in its MOT History (14 Tests).

4 common/recurring faults, the most frequent (3 times) is: Brakes imbalanced across an axle (3.7.B.5b).

71% (10) MOT Pass Rate and a 29% (4) MOT Failure Rate.

98,183 recorded miles.

JVF 811D


JVF811D is registered to a Blue 1966, Morris Minor 1000 with a Petrol engine. It Passed its most recent MOT Test on the 07 August 2018

37 unique faults (42 Total) reported in its MOT History (14 Tests).

4 common/recurring faults, the most frequent (3 times) is: Brakes imbalanced across an axle (3.7.B.5b).

71% (10) MOT Pass Rate and a 29% (4) MOT Failure Rate.

98,183 recorded miles.

MOT PASS/Failure rate for JVF 811D

all MOT test results for JVF 811D represented as a percentage
MOT PASS/Failure rate for JVF 811D
all MOT test results for JVF 811D represented as a percentage

PERCENTAGE OF VEHICLE FAULTS WITH JVF 811D

ALL REPORTED FAULTS, DISPLAYED BY PERCENTAGE OF OCCURRENCE DURING ALL MOT TESTS
PERCENTAGE OF VEHICLE FAULTS WITH JVF 811D
ALL REPORTED FAULTS, DISPLAYED BY PERCENTAGE OF OCCURRENCE DURING ALL MOT TESTS
ADVISORY

FAIL

USER ENTERED

MINOR

JVF 811D annual Faults by type

ALL REPORTED FAULTS, DISPLAYED over time and categorised by type
JVF 811D annual Faults by type
ALL REPORTED FAULTS, DISPLAYED over time and categorised by type

RECURRING FAULTS WITH JVF 811D

FAULTS THAT HAVE OCCURED MORE THAN ONCE DURING JVF 811D's MOT HISTORY
RECURRING FAULTS WITH JVF 811D
FAULTS THAT HAVE OCCURED MORE THAN ONCE DURING JVF 811D's MOT HISTORY
Fault Fault Test Date Test Date/Time Reference MOT Test Reference
3 Brakes imbalanced across an axle (3.7.b.5b) Brakes imbalanced across an axle (3.7.b.5b) 24 June 2013 [10:08] 24/06/2013 04 May 2007 [14:59] 04/05/2007 18 May 2006 [14:59] 18/05/2006 307195273131 307195273131 163234727159 163234727159 354058836198 354058836198
2 Offside rear suspension component mounting prescribed area is excessively corroded (2.4.a.3) Offside rear suspension component mounting prescribed area is excessively corroded (2.4.a.3) 11 August 2015 [11:06] 11/08/2015 18 May 2006 [14:59] 18/05/2006 237243525270 237243525270 354058836198 354058836198
2 Nearside front front wheel bearing has excessive play (2.5.a.3c) Nearside front front wheel bearing has excessive play (2.5.a.3c) 11 August 2015 [11:06] 11/08/2015 18 May 2006 [14:59] 18/05/2006 237243525270 237243525270 354058836198 354058836198
2 General underbody corrosion General underbody corrosion 12 May 2008 [15:05] 12/05/2008 04 May 2007 [14:59] 04/05/2007 494583838185 494583838185 163234727159 163234727159

ALL JVF 811D ADVISORIES [10]

ALL ADVISORIES, ORDERED by OCCURRENCE DURING JVF 811D's MOT HISTORY
ALL JVF 811D ADVISORIES [10]
ALL ADVISORIES, ORDERED by OCCURRENCE DURING JVF 811D's MOT HISTORY
Advisory Faults | source www.vehiclestats.co.uk
Fault Fault Test Date Test Date/Time Reference MOT Test Reference
1 Nearside front vehicle structure is corroded but structural rigidity is not significantly reduced (6.1.1 (c) (i)) Nearside front vehicle structure is corroded but structural rigidity is not significantly reduced (6.1.1 (c) (i)) 07 August 2018 [16:02] 07/08/2018 107580028140 107580028140
1 Offside rear vehicle structure is corroded but structural rigidity is not significantly reduced (6.1.1 (c) (i)) Offside rear vehicle structure is corroded but structural rigidity is not significantly reduced (6.1.1 (c) (i)) 07 August 2018 [16:02] 07/08/2018 107580028140 107580028140
1 Offside front wheel bearing has slight play (2.5.a.3c) Offside front wheel bearing has slight play (2.5.a.3c) 04 August 2014 [16:22] 04/08/2014 228226614249 228226614249
1 Nearside front suspension has slight deterioration of the bonding between metal and flexible material of an upper support bearing (2.5.b.3a) Nearside front suspension has slight deterioration of the bonding between metal and flexible material of an upper support bearing (2.5.b.3a) 04 August 2014 [16:22] 04/08/2014 228226614249 228226614249
1 Rear fog lamp has light sources not illuminating, but not more than 50% (1.3.2b) Rear fog lamp has light sources not illuminating, but not more than 50% (1.3.2b) 24 June 2013 [10:08] 24/06/2013 307195273131 307195273131
1 Front brake pad(s) wearing thin (3.5.1g) Front brake pad(s) wearing thin (3.5.1g) 24 June 2013 [10:08] 24/06/2013 307195273131 307195273131
1 Front brake disc worn, pitted or scored, but not seriously weakened (3.5.1i) Front brake disc worn, pitted or scored, but not seriously weakened (3.5.1i) 24 June 2013 [10:08] 24/06/2013 307195273131 307195273131
1 Nearside headlamp damaged but light output not reduced (1.7.5a) Nearside headlamp damaged but light output not reduced (1.7.5a) 12 May 2008 [15:05] 12/05/2008 494583838185 494583838185
1 Offside headlamp damaged but light output not reduced (1.7.5a) Offside headlamp damaged but light output not reduced (1.7.5a) 12 May 2008 [15:05] 12/05/2008 494583838185 494583838185
1 Offside front front suspension has slight play in a lower suspension ball joint (2.5.b.1a) Offside front front suspension has slight play in a lower suspension ball joint (2.5.b.1a) 04 May 2007 [14:59] 04/05/2007 163234727159 163234727159

ALL JVF 811D Failure Faults [29]

ALL Failure faults, ORDERED by OCCURRENCE DURING JVF 811D's MOT HISTORY
ALL JVF 811D Failure Faults [29]
ALL Failure faults, ORDERED by OCCURRENCE DURING JVF 811D's MOT HISTORY
Fail Faults | source www.vehiclestats.co.uk
Fault Fault Test Date Test Date/Time Reference MOT Test Reference
3 Brakes imbalanced across an axle (3.7.b.5b) Brakes imbalanced across an axle (3.7.b.5b) 24 June 2013 [10:08] 24/06/2013 04 May 2007 [14:59] 04/05/2007 18 May 2006 [14:59] 18/05/2006 307195273131 307195273131 163234727159 163234727159 354058836198 354058836198
2 Offside rear suspension component mounting prescribed area is excessively corroded (2.4.a.3) Offside rear suspension component mounting prescribed area is excessively corroded (2.4.a.3) 11 August 2015 [11:06] 11/08/2015 18 May 2006 [14:59] 18/05/2006 237243525270 237243525270 354058836198 354058836198
2 Nearside front front wheel bearing has excessive play (2.5.a.3c) Nearside front front wheel bearing has excessive play (2.5.a.3c) 11 August 2015 [11:06] 11/08/2015 18 May 2006 [14:59] 18/05/2006 237243525270 237243525270 354058836198 354058836198
1 Nearside rear stop lamp not working (1.2.1b) Nearside rear stop lamp not working (1.2.1b) 11 August 2015 [11:06] 11/08/2015 237243525270 237243525270
1 Offside front front wheel bearing has excessive play (2.5.a.3c) Offside front front wheel bearing has excessive play (2.5.a.3c) 11 August 2015 [11:06] 11/08/2015 237243525270 237243525270
1 Nearside front body or chassis has excessive corrosion, seriously affecting its strength within 30cm of the body mountings (6.1.b.2) Nearside front body or chassis has excessive corrosion, seriously affecting its strength within 30cm of the body mountings (6.1.b.2) 11 August 2015 [11:06] 11/08/2015 237243525270 237243525270
1 Steering column shaft has excessive end float (2.1.3) Steering column shaft has excessive end float (2.1.3) 11 August 2015 [11:06] 11/08/2015 237243525270 237243525270
1 Service brake: efficiency below requirements (3.7.b.7) Service brake: efficiency below requirements (3.7.b.7) 11 August 2015 [11:06] 11/08/2015 237243525270 237243525270
1 Parking brake: efficiency below requirements (3.7.b.7) Parking brake: efficiency below requirements (3.7.b.7) 11 August 2015 [11:06] 11/08/2015 237243525270 237243525270
1 Offside front windscreen wiper does not clear the windscreen effectively (8.2.2) Offside front windscreen wiper does not clear the windscreen effectively (8.2.2) 24 June 2013 [10:08] 24/06/2013 307195273131 307195273131
1 Drivers seat insecure (6.2.a.1) Drivers seat insecure (6.2.a.1) 24 June 2013 [10:08] 24/06/2013 307195273131 307195273131
1 Nearside front headlamp not working on main beam (1.7.5a) Nearside front headlamp not working on main beam (1.7.5a) 24 June 2013 [10:08] 24/06/2013 307195273131 307195273131
1 Offside front headlamp not working on main beam (1.7.5a) Offside front headlamp not working on main beam (1.7.5a) 24 June 2013 [10:08] 24/06/2013 307195273131 307195273131
1 Nearside front vehicle structure has excessive corrosion, seriously affecting its strength within 30cm of the body mountings (6.1.b.2) Nearside front vehicle structure has excessive corrosion, seriously affecting its strength within 30cm of the body mountings (6.1.b.2) 24 June 2013 [10:08] 24/06/2013 307195273131 307195273131
1 Nearside rear vehicle structure has excessive corrosion, seriously affecting its strength within 30cm of the body mountings (6.1.b.2) Nearside rear vehicle structure has excessive corrosion, seriously affecting its strength within 30cm of the body mountings (6.1.b.2) 24 June 2013 [10:08] 24/06/2013 307195273131 307195273131
1 Offside front vehicle structure has excessive corrosion, seriously affecting its strength within 30cm of the body mountings (6.1.b.2) Offside front vehicle structure has excessive corrosion, seriously affecting its strength within 30cm of the body mountings (6.1.b.2) 24 June 2013 [10:08] 24/06/2013 307195273131 307195273131
1 Offside rear vehicle structure has excessive corrosion, seriously affecting its strength within 30cm of the body mountings (6.1.b.2) Offside rear vehicle structure has excessive corrosion, seriously affecting its strength within 30cm of the body mountings (6.1.b.2) 24 June 2013 [10:08] 24/06/2013 307195273131 307195273131
1 Offside rear braking system leaking (3.6.a.1) Offside rear braking system leaking (3.6.a.1) 24 June 2013 [10:08] 24/06/2013 307195273131 307195273131
1 Parking brake: efficiency below requirements (3.7.d.4) Parking brake: efficiency below requirements (3.7.d.4) 24 June 2013 [10:08] 24/06/2013 307195273131 307195273131
1 Rear registration plate lamp not working (1.1.5c) Rear registration plate lamp not working (1.1.5c) 04 May 2007 [14:59] 04/05/2007 163234727159 163234727159
1 Nearside front suspension component mounting prescribed area is excessively corroded (2.4.a.3) Nearside front suspension component mounting prescribed area is excessively corroded (2.4.a.3) 04 May 2007 [14:59] 04/05/2007 163234727159 163234727159
1 Offside rear registration plate lamp not working (1.1.c.1d) Offside rear registration plate lamp not working (1.1.c.1d) 18 May 2006 [14:59] 18/05/2006 354058836198 354058836198
1 Nearside rear suspension spring mounting prescribed area is excessively corroded (2.4.a.3) Nearside rear suspension spring mounting prescribed area is excessively corroded (2.4.a.3) 18 May 2006 [14:59] 18/05/2006 354058836198 354058836198
1 Offside front tyre tread depth below requirements of 1.6mm (4.1.e.1) Offside front tyre tread depth below requirements of 1.6mm (4.1.e.1) 18 May 2006 [14:59] 18/05/2006 354058836198 354058836198
1 Nearside front suspension spring mounting prescribed area is excessively corroded (2.4.a.3) Nearside front suspension spring mounting prescribed area is excessively corroded (2.4.a.3) 18 May 2006 [14:59] 18/05/2006 354058836198 354058836198

ALL JVF 811D minor Faults [1]

ALL minor faults, ORDERED by OCCURRENCE DURING JVF 811D's MOT HISTORY
ALL JVF 811D minor Faults [1]
ALL minor faults, ORDERED by OCCURRENCE DURING JVF 811D's MOT HISTORY
Advisory Faults | source www.vehiclestats.co.uk
Fault Fault Test Date Test Date/Time Reference MOT Test Reference
1 Nearside front headlamp reflector slightly defective (4.1.1 (b) (i)) Nearside front headlamp reflector slightly defective (4.1.1 (b) (i)) 07 August 2018 [16:02] 07/08/2018 107580028140 107580028140

ALL JVF 811D User Entered Faults [2]

ALL User Entered faults, ORDERED by OCCURRENCE DURING JVF 811D's MOT HISTORY
ALL JVF 811D User Entered Faults [2]
ALL User Entered faults, ORDERED by OCCURRENCE DURING JVF 811D's MOT HISTORY
Advisory Faults | source www.vehiclestats.co.uk
Fault Fault Test Date Test Date/Time Reference MOT Test Reference
2 General underbody corrosion General underbody corrosion 12 May 2008 [15:05] 12/05/2008 04 May 2007 [14:59] 04/05/2007 494583838185 494583838185 163234727159 163234727159

MOT TEST: 07 August 2018 16:02:37 PASSED
MOT TEST: 07 August 2018 16:02:37 PASSED

This test (107580028140) was completed on the 07 August 2018 16:02:37 and PASSED the requirements for a valid MOT with 3 comments.

This test (107580028140) was completed on the 07 August 2018 16:02:37 and PASSED the requirements for a valid MOT with 3 comments.

Recorded mileage: 13,844

Recorded mileage: 13,844


ADVISORY

MINOR


MOT TEST: 11 August 2015 11:06:51 FAILED
MOT TEST: 11 August 2015 11:06:51 FAILED

This test (237243525270) was completed on the 11 August 2015 11:06:51 and FAILED the requirements for a valid MOT with 8 comments.

This test (237243525270) was completed on the 11 August 2015 11:06:51 and FAILED the requirements for a valid MOT with 8 comments.

Recorded mileage: 13,778

Recorded mileage: 13,778


FAIL


MOT TEST: 04 August 2014 16:22:13 PASSED
MOT TEST: 04 August 2014 16:22:13 PASSED

This test (228226614249) was completed on the 04 August 2014 16:22:13 and PASSED the requirements for a valid MOT with 2 comments.

This test (228226614249) was completed on the 04 August 2014 16:22:13 and PASSED the requirements for a valid MOT with 2 comments.

Recorded mileage: 2,354

Recorded mileage: 2,354


ADVISORY


MOT TEST: 13 August 2013 15:39:40 PASSED
MOT TEST: 13 August 2013 15:39:40 PASSED

This test (889765523283) was completed on the 13 August 2013 15:39:40 and PASSED the requirements for a valid MOT with 0 comments.

This test (889765523283) was completed on the 13 August 2013 15:39:40 and PASSED the requirements for a valid MOT with 0 comments.

Recorded mileage: 8,687

Recorded mileage: 8,687


MOT TEST: 24 June 2013 10:08:07 FAILED
MOT TEST: 24 June 2013 10:08:07 FAILED

This test (307195273131) was completed on the 24 June 2013 10:08:07 and FAILED the requirements for a valid MOT with 14 comments.

This test (307195273131) was completed on the 24 June 2013 10:08:07 and FAILED the requirements for a valid MOT with 14 comments.

Recorded mileage: 8,537

Recorded mileage: 8,537


ADVISORY

FAIL


MOT TEST: 16 June 2012 09:06:20 PASSED
MOT TEST: 16 June 2012 09:06:20 PASSED

This test (569018062171) was completed on the 16 June 2012 09:06:20 and PASSED the requirements for a valid MOT with 0 comments.

This test (569018062171) was completed on the 16 June 2012 09:06:20 and PASSED the requirements for a valid MOT with 0 comments.

Recorded mileage: 98,183

Recorded mileage: 98,183


MOT TEST: 11 June 2011 09:32:14 PASSED
MOT TEST: 11 June 2011 09:32:14 PASSED

This test (665962161185) was completed on the 11 June 2011 09:32:14 and PASSED the requirements for a valid MOT with 0 comments.

This test (665962161185) was completed on the 11 June 2011 09:32:14 and PASSED the requirements for a valid MOT with 0 comments.

Recorded mileage: 97,654

Recorded mileage: 97,654


MOT TEST: 05 June 2010 09:46:57 PASSED
MOT TEST: 05 June 2010 09:46:57 PASSED

This test (274736550485) was completed on the 05 June 2010 09:46:57 and PASSED the requirements for a valid MOT with 0 comments.

This test (274736550485) was completed on the 05 June 2010 09:46:57 and PASSED the requirements for a valid MOT with 0 comments.

Recorded mileage: 96,690

Recorded mileage: 96,690


MOT TEST: 05 May 2009 17:49:30 PASSED
MOT TEST: 05 May 2009 17:49:30 PASSED

This test (230095929414) was completed on the 05 May 2009 17:49:30 and PASSED the requirements for a valid MOT with 0 comments.

This test (230095929414) was completed on the 05 May 2009 17:49:30 and PASSED the requirements for a valid MOT with 0 comments.

Recorded mileage: 96,005

Recorded mileage: 96,005


MOT TEST: 12 May 2008 15:05:01 PASSED
MOT TEST: 12 May 2008 15:05:01 PASSED

This test (494583838185) was completed on the 12 May 2008 15:05:01 and PASSED the requirements for a valid MOT with 3 comments.

This test (494583838185) was completed on the 12 May 2008 15:05:01 and PASSED the requirements for a valid MOT with 3 comments.

Recorded mileage: 95,353

Recorded mileage: 95,353


ADVISORY

USER ENTERED


MOT TEST: 10 May 2007 11:43:34 PASSED
MOT TEST: 10 May 2007 11:43:34 PASSED

This test (253490037414) was completed on the 10 May 2007 11:43:34 and PASSED the requirements for a valid MOT with 0 comments.

This test (253490037414) was completed on the 10 May 2007 11:43:34 and PASSED the requirements for a valid MOT with 0 comments.

Recorded mileage: 95,171

Recorded mileage: 95,171


MOT TEST: 04 May 2007 14:59:57 FAILED
MOT TEST: 04 May 2007 14:59:57 FAILED

This test (163234727159) was completed on the 04 May 2007 14:59:57 and FAILED the requirements for a valid MOT with 5 comments.

This test (163234727159) was completed on the 04 May 2007 14:59:57 and FAILED the requirements for a valid MOT with 5 comments.

Recorded mileage: 95,158

Recorded mileage: 95,158


ADVISORY

FAIL

USER ENTERED


MOT TEST: 01 June 2006 16:27:36 PASSED
MOT TEST: 01 June 2006 16:27:36 PASSED

This test (523232156117) was completed on the 01 June 2006 16:27:36 and PASSED the requirements for a valid MOT with 0 comments.

This test (523232156117) was completed on the 01 June 2006 16:27:36 and PASSED the requirements for a valid MOT with 0 comments.

Recorded mileage: 94,551

Recorded mileage: 94,551


MOT TEST: 18 May 2006 14:59:40 FAILED
MOT TEST: 18 May 2006 14:59:40 FAILED

This test (354058836198) was completed on the 18 May 2006 14:59:40 and FAILED the requirements for a valid MOT with 7 comments.

This test (354058836198) was completed on the 18 May 2006 14:59:40 and FAILED the requirements for a valid MOT with 7 comments.

Recorded mileage: 94,551

Recorded mileage: 94,551


FAIL