JVS 995


JVS995 is registered to a White 1962, Morris Minor with a Petrol engine. It Failed its most recent MOT Test on the 01 June 2006

8 unique faults (9 Total) reported in its MOT History (2 Tests).

0 common/recurring faults.

50% (1) MOT Pass Rate and a 50% (1) MOT Failure Rate.

42,993 recorded miles.

JVS 995


JVS995 is registered to a White 1962, Morris Minor with a Petrol engine. It Failed its most recent MOT Test on the 01 June 2006

8 unique faults (9 Total) reported in its MOT History (2 Tests).

0 common/recurring faults.

50% (1) MOT Pass Rate and a 50% (1) MOT Failure Rate.

42,993 recorded miles.

MOT PASS/Failure rate for JVS 995

all MOT test results for JVS 995 represented as a percentage
MOT PASS/Failure rate for JVS 995
all MOT test results for JVS 995 represented as a percentage

PERCENTAGE OF VEHICLE FAULTS WITH JVS 995

ALL REPORTED FAULTS, DISPLAYED BY PERCENTAGE OF OCCURRENCE DURING ALL MOT TESTS
PERCENTAGE OF VEHICLE FAULTS WITH JVS 995
ALL REPORTED FAULTS, DISPLAYED BY PERCENTAGE OF OCCURRENCE DURING ALL MOT TESTS
FAIL

USER ENTERED

JVS 995 annual Faults by type

ALL REPORTED FAULTS, DISPLAYED over time and categorised by type
JVS 995 annual Faults by type
ALL REPORTED FAULTS, DISPLAYED over time and categorised by type

ALL JVS 995 Failure Faults [7]

ALL Failure faults, ORDERED by OCCURRENCE DURING JVS 995's MOT HISTORY
ALL JVS 995 Failure Faults [7]
ALL Failure faults, ORDERED by OCCURRENCE DURING JVS 995's MOT HISTORY
Fail Faults | source www.vehiclestats.co.uk
Fault Fault Test Date Test Date/Time Reference MOT Test Reference
1 Front passenger door cannot be opened from outside the vehicle (6.2.b.1b) Front passenger door cannot be opened from outside the vehicle (6.2.b.1b) 31 May 2006 [09:58] 31/05/2006 424411456164 424411456164
1 Nearside front suspension spring mounting prescribed area is excessively corroded (2.4.a.3) Nearside front suspension spring mounting prescribed area is excessively corroded (2.4.a.3) 31 May 2006 [09:58] 31/05/2006 424411456164 424411456164
1 Offside front suspension spring mounting prescribed area is excessively corroded (2.4.a.3) Offside front suspension spring mounting prescribed area is excessively corroded (2.4.a.3) 31 May 2006 [09:58] 31/05/2006 424411456164 424411456164
1 Nearside rear suspension spring mounting prescribed area is excessively corroded (2.4.a.3) Nearside rear suspension spring mounting prescribed area is excessively corroded (2.4.a.3) 31 May 2006 [09:58] 31/05/2006 424411456164 424411456164
1 Offside rear suspension spring mounting prescribed area is excessively corroded (2.4.a.3) Offside rear suspension spring mounting prescribed area is excessively corroded (2.4.a.3) 31 May 2006 [09:58] 31/05/2006 424411456164 424411456164
1 Nearside front tyre tread depth below requirements of 1.6mm (4.1.e.1) Nearside front tyre tread depth below requirements of 1.6mm (4.1.e.1) 31 May 2006 [09:58] 31/05/2006 424411456164 424411456164

ALL JVS 995 User Entered Faults [2]

ALL User Entered faults, ORDERED by OCCURRENCE DURING JVS 995's MOT HISTORY
ALL JVS 995 User Entered Faults [2]
ALL User Entered faults, ORDERED by OCCURRENCE DURING JVS 995's MOT HISTORY
User Entered Faults | source www.vehiclestats.co.uk
Fault Fault Test Date Test Date/Time Reference MOT Test Reference
1 Has had a lot of welding and is heaverly under sealed Has had a lot of welding and is heaverly under sealed 01 June 2006 [16:31] 01/06/2006 184142856155 184142856155
1 Has had a lot of welding and under sealed Has had a lot of welding and under sealed 31 May 2006 [09:58] 31/05/2006 424411456164 424411456164

MOT TEST: 01 June 2006 16:31:18 PASSED
MOT TEST: 01 June 2006 16:31:18 PASSED

This test (184142856155) was completed on the 01 June 2006 16:31:18 and PASSED the requirements for a valid MOT with 1 comments.

This test (184142856155) was completed on the 01 June 2006 16:31:18 and PASSED the requirements for a valid MOT with 1 comments.

Recorded mileage: 42,993

Recorded mileage: 42,993


USER ENTERED


MOT TEST: 31 May 2006 09:58:27 FAILED
MOT TEST: 31 May 2006 09:58:27 FAILED

This test (424411456164) was completed on the 31 May 2006 09:58:27 and FAILED the requirements for a valid MOT with 8 comments.

This test (424411456164) was completed on the 31 May 2006 09:58:27 and FAILED the requirements for a valid MOT with 8 comments.

Recorded mileage: 42,993

Recorded mileage: 42,993


FAIL

USER ENTERED