JWA 526J


JWA526J is registered to a Blue 1971, Morris Minor 1000 with a Petrol engine. It Failed its most recent MOT Test on the 16 June 2011

4 unique faults (4 Total) reported in its MOT History (3 Tests).

0 common/recurring faults.

67% (2) MOT Pass Rate and a 33% (1) MOT Failure Rate.

13,239 recorded miles.

JWA 526J


JWA526J is registered to a Blue 1971, Morris Minor 1000 with a Petrol engine. It Failed its most recent MOT Test on the 16 June 2011

4 unique faults (4 Total) reported in its MOT History (3 Tests).

0 common/recurring faults.

67% (2) MOT Pass Rate and a 33% (1) MOT Failure Rate.

13,239 recorded miles.

MOT PASS/Failure rate for JWA 526J

all MOT test results for JWA 526J represented as a percentage
MOT PASS/Failure rate for JWA 526J
all MOT test results for JWA 526J represented as a percentage

PERCENTAGE OF VEHICLE FAULTS WITH JWA 526J

ALL REPORTED FAULTS, DISPLAYED BY PERCENTAGE OF OCCURRENCE DURING ALL MOT TESTS
PERCENTAGE OF VEHICLE FAULTS WITH JWA 526J
ALL REPORTED FAULTS, DISPLAYED BY PERCENTAGE OF OCCURRENCE DURING ALL MOT TESTS
FAIL

JWA 526J annual Faults by type

ALL REPORTED FAULTS, DISPLAYED over time and categorised by type
JWA 526J annual Faults by type
ALL REPORTED FAULTS, DISPLAYED over time and categorised by type

ALL JWA 526J Failure Faults [4]

ALL Failure faults, ORDERED by OCCURRENCE DURING JWA 526J's MOT HISTORY
ALL JWA 526J Failure Faults [4]
ALL Failure faults, ORDERED by OCCURRENCE DURING JWA 526J's MOT HISTORY
Fail Faults | source www.vehiclestats.co.uk
Fault Fault Test Date Test Date/Time Reference MOT Test Reference
1 Front registration plate missing (6.3.1a) Front registration plate missing (6.3.1a) 14 June 2011 [16:43] 14/06/2011 286015461164 286015461164
1 Nearside stop lamp not working (1.2.1b) Nearside stop lamp not working (1.2.1b) 14 June 2011 [16:43] 14/06/2011 286015461164 286015461164
1 Offside stop lamp not working (1.2.1b) Offside stop lamp not working (1.2.1b) 14 June 2011 [16:43] 14/06/2011 286015461164 286015461164
1 Nearside front position lamp(s) not working (1.1.a.3b) Nearside front position lamp(s) not working (1.1.a.3b) 14 June 2011 [16:43] 14/06/2011 286015461164 286015461164

MOT TEST: 16 June 2011 09:21:46 PASSED
MOT TEST: 16 June 2011 09:21:46 PASSED

This test (618377061195) was completed on the 16 June 2011 09:21:46 and PASSED the requirements for a valid MOT with 0 comments.

This test (618377061195) was completed on the 16 June 2011 09:21:46 and PASSED the requirements for a valid MOT with 0 comments.

Recorded mileage: 13,239

Recorded mileage: 13,239


MOT TEST: 14 June 2011 16:43:50 FAILED
MOT TEST: 14 June 2011 16:43:50 FAILED

This test (286015461164) was completed on the 14 June 2011 16:43:50 and FAILED the requirements for a valid MOT with 4 comments.

This test (286015461164) was completed on the 14 June 2011 16:43:50 and FAILED the requirements for a valid MOT with 4 comments.

Recorded mileage: 13,234

Recorded mileage: 13,234


FAIL


MOT TEST: 02 June 2009 08:41:41 PASSED
MOT TEST: 02 June 2009 08:41:41 PASSED

This test (262583159120) was completed on the 02 June 2009 08:41:41 and PASSED the requirements for a valid MOT with 0 comments.

This test (262583159120) was completed on the 02 June 2009 08:41:41 and PASSED the requirements for a valid MOT with 0 comments.

Recorded mileage: 13,230

Recorded mileage: 13,230