JWR 734J


JWR734J is registered to a White 1971, Morris Mini 1000 with a Petrol engine. It Failed its most recent MOT Test on the 15 May 2018

29 unique faults (32 Total) reported in its MOT History (9 Tests).

3 common/recurring faults, the most frequent (2 times) is: Nearside Front Front position lamp(s) not working (1.1.A.3b).

67% (6) MOT Pass Rate and a 33% (3) MOT Failure Rate.

39,392 recorded miles.

JWR 734J


JWR734J is registered to a White 1971, Morris Mini 1000 with a Petrol engine. It Failed its most recent MOT Test on the 15 May 2018

29 unique faults (32 Total) reported in its MOT History (9 Tests).

3 common/recurring faults, the most frequent (2 times) is: Nearside Front Front position lamp(s) not working (1.1.A.3b).

67% (6) MOT Pass Rate and a 33% (3) MOT Failure Rate.

39,392 recorded miles.

MOT PASS/Failure rate for JWR 734J

all MOT test results for JWR 734J represented as a percentage
MOT PASS/Failure rate for JWR 734J
all MOT test results for JWR 734J represented as a percentage

PERCENTAGE OF VEHICLE FAULTS WITH JWR 734J

ALL REPORTED FAULTS, DISPLAYED BY PERCENTAGE OF OCCURRENCE DURING ALL MOT TESTS
PERCENTAGE OF VEHICLE FAULTS WITH JWR 734J
ALL REPORTED FAULTS, DISPLAYED BY PERCENTAGE OF OCCURRENCE DURING ALL MOT TESTS
ADVISORY

FAIL

USER ENTERED

JWR 734J annual Faults by type

ALL REPORTED FAULTS, DISPLAYED over time and categorised by type
JWR 734J annual Faults by type
ALL REPORTED FAULTS, DISPLAYED over time and categorised by type

RECURRING FAULTS WITH JWR 734J

FAULTS THAT HAVE OCCURED MORE THAN ONCE DURING JWR 734J's MOT HISTORY
RECURRING FAULTS WITH JWR 734J
FAULTS THAT HAVE OCCURED MORE THAN ONCE DURING JWR 734J's MOT HISTORY
Fault Fault Test Date Test Date/Time Reference MOT Test Reference
2 Nearside front front position lamp(s) not working (1.1.a.3b) Nearside front front position lamp(s) not working (1.1.a.3b) 20 June 2013 [09:12] 20/06/2013 18 May 2012 [08:45] 18/05/2012 145551373123 145551373123 196789032100 196789032100
2 Nearside windscreen washer provides insufficient washer liquid (8.2.3) Nearside windscreen washer provides insufficient washer liquid (8.2.3) 20 June 2013 [09:12] 20/06/2013 18 May 2012 [08:45] 18/05/2012 145551373123 145551373123 196789032100 196789032100
2 Offside windscreen washer provides insufficient washer liquid (8.2.3) Offside windscreen washer provides insufficient washer liquid (8.2.3) 20 June 2013 [09:12] 20/06/2013 18 May 2012 [08:45] 18/05/2012 145551373123 145551373123 196789032100 196789032100

ALL JWR 734J ADVISORIES [7]

ALL ADVISORIES, ORDERED by OCCURRENCE DURING JWR 734J's MOT HISTORY
ALL JWR 734J ADVISORIES [7]
ALL ADVISORIES, ORDERED by OCCURRENCE DURING JWR 734J's MOT HISTORY
Fail Faults | source www.vehiclestats.co.uk
Fault Fault Test Date Test Date/Time Reference MOT Test Reference
1 Front exhaust has a minor leak of exhaust gases (7.1.2) Front exhaust has a minor leak of exhaust gases (7.1.2) 23 May 2016 [08:07] 23/05/2016 462401839542 462401839542
1 Rear silencer deteriorated Rear silencer deteriorated 23 May 2016 [08:07] 23/05/2016 462401839542 462401839542
1 Nearside front shock absorber has a light misting of oil v. Slight (2.7.3) Nearside front shock absorber has a light misting of oil v. Slight (2.7.3) 23 May 2016 [08:07] 23/05/2016 462401839542 462401839542
1 Offside front suspension has slight play in a upper suspension ball joint (2.5.b.1a) Offside front suspension has slight play in a upper suspension ball joint (2.5.b.1a) 23 May 2016 [08:07] 23/05/2016 462401839542 462401839542
1 Nearside front front wheel bearing has slight play (2.5.a.3c) Nearside front front wheel bearing has slight play (2.5.a.3c) 11 June 2014 [11:52] 11/06/2014 427612464134 427612464134
1 Offside front front wheel bearing has slight play (2.5.a.3c) Offside front front wheel bearing has slight play (2.5.a.3c) 20 June 2013 [09:12] 20/06/2013 145551373123 145551373123
1 Service brake: service brake efficiency only just met. It would appear that the braking system requires adjustment or repair. (3.7.b.7) Service brake: service brake efficiency only just met. It would appear that the braking system requires adjustment or repair. (3.7.b.7) 18 May 2012 [08:45] 18/05/2012 196789032100 196789032100

ALL JWR 734J Failure Faults [24]

ALL Failure faults, ORDERED by OCCURRENCE DURING JWR 734J's MOT HISTORY
ALL JWR 734J Failure Faults [24]
ALL Failure faults, ORDERED by OCCURRENCE DURING JWR 734J's MOT HISTORY
Fail Faults | source www.vehiclestats.co.uk
Fault Fault Test Date Test Date/Time Reference MOT Test Reference
2 Nearside front front position lamp(s) not working (1.1.a.3b) Nearside front front position lamp(s) not working (1.1.a.3b) 20 June 2013 [09:12] 20/06/2013 18 May 2012 [08:45] 18/05/2012 145551373123 145551373123 196789032100 196789032100
2 Nearside windscreen washer provides insufficient washer liquid (8.2.3) Nearside windscreen washer provides insufficient washer liquid (8.2.3) 20 June 2013 [09:12] 20/06/2013 18 May 2012 [08:45] 18/05/2012 145551373123 145551373123 196789032100 196789032100
2 Offside windscreen washer provides insufficient washer liquid (8.2.3) Offside windscreen washer provides insufficient washer liquid (8.2.3) 20 June 2013 [09:12] 20/06/2013 18 May 2012 [08:45] 18/05/2012 145551373123 145551373123 196789032100 196789032100
1 Service brake: efficiency below requirements (3.7.b.7) Service brake: efficiency below requirements (3.7.b.7) 23 May 2016 [08:07] 23/05/2016 462401839542 462401839542
1 Rear brakes imbalanced across an axle axle 2 (3.7.b.5b) Rear brakes imbalanced across an axle axle 2 (3.7.b.5b) 23 May 2016 [08:07] 23/05/2016 462401839542 462401839542
1 Nearside headlamp not working on main beam (1.7.5a) Nearside headlamp not working on main beam (1.7.5a) 23 May 2016 [08:07] 23/05/2016 462401839542 462401839542
1 Offside headlamp not working on main beam (1.7.5a) Offside headlamp not working on main beam (1.7.5a) 23 May 2016 [08:07] 23/05/2016 462401839542 462401839542
1 Rear exhaust system not adequately supported mounting sheared (7.1.1) Rear exhaust system not adequately supported mounting sheared (7.1.1) 23 May 2016 [08:07] 23/05/2016 462401839542 462401839542
1 Nearside rear brake recording little or no effort no effort (3.7.b.5a) Nearside rear brake recording little or no effort no effort (3.7.b.5a) 23 May 2016 [08:07] 23/05/2016 462401839542 462401839542
1 Nearside windscreen wiper does not clear the windscreen effectively (8.2.2) Nearside windscreen wiper does not clear the windscreen effectively (8.2.2) 23 May 2016 [08:07] 23/05/2016 462401839542 462401839542
1 Nearside outer front constant velocity joint gaiter insecure to the extent that it no longer prevents the ingress of dirt etc (2.5.c.1a) Nearside outer front constant velocity joint gaiter insecure to the extent that it no longer prevents the ingress of dirt etc (2.5.c.1a) 23 May 2016 [08:07] 23/05/2016 462401839542 462401839542
1 Offside outer front constant velocity joint gaiter insecure to the extent that it no longer prevents the ingress of dirt etc (2.5.c.1a) Offside outer front constant velocity joint gaiter insecure to the extent that it no longer prevents the ingress of dirt etc (2.5.c.1a) 23 May 2016 [08:07] 23/05/2016 462401839542 462401839542
1 Nearside front drive shaft coupling flexible rubber or fabric coupling unit breaking up (2.5.c.1d) Nearside front drive shaft coupling flexible rubber or fabric coupling unit breaking up (2.5.c.1d) 23 May 2016 [08:07] 23/05/2016 462401839542 462401839542
1 Nearside track rod end ball joint dust cover excessively deteriorated so that it no longer prevents the ingress of dirt (2.2.c.1c) Nearside track rod end ball joint dust cover excessively deteriorated so that it no longer prevents the ingress of dirt (2.2.c.1c) 23 May 2016 [08:07] 23/05/2016 462401839542 462401839542
1 Offside track rod end ball joint dust cover excessively deteriorated so that it no longer prevents the ingress of dirt (2.2.c.1c) Offside track rod end ball joint dust cover excessively deteriorated so that it no longer prevents the ingress of dirt (2.2.c.1c) 23 May 2016 [08:07] 23/05/2016 462401839542 462401839542
1 Offside rear rear position lamp(s) not working (1.1.a.3b) Offside rear rear position lamp(s) not working (1.1.a.3b) 20 June 2013 [09:12] 20/06/2013 145551373123 145551373123
1 Nearside rear registration plate lamp not working (1.1.c.1d) Nearside rear registration plate lamp not working (1.1.c.1d) 20 June 2013 [09:12] 20/06/2013 145551373123 145551373123
1 Nearside front front wheel bearing has excessive play (2.5.a.3c) Nearside front front wheel bearing has excessive play (2.5.a.3c) 20 June 2013 [09:12] 20/06/2013 145551373123 145551373123
1 Brake pipe inadequately supported (3.6.b.1) Brake pipe inadequately supported (3.6.b.1) 20 June 2013 [09:12] 20/06/2013 145551373123 145551373123
1 Nearside rear rear brake recording little or no effort (3.7.b.5a) Nearside rear rear brake recording little or no effort (3.7.b.5a) 18 May 2012 [08:45] 18/05/2012 196789032100 196789032100
1 Offside rear rear brake recording little or no effort (3.7.b.5a) Offside rear rear brake recording little or no effort (3.7.b.5a) 18 May 2012 [08:45] 18/05/2012 196789032100 196789032100

ALL JWR 734J User Entered Faults [1]

ALL User Entered faults, ORDERED by OCCURRENCE DURING JWR 734J's MOT HISTORY
ALL JWR 734J User Entered Faults [1]
ALL User Entered faults, ORDERED by OCCURRENCE DURING JWR 734J's MOT HISTORY
Fail Faults | source www.vehiclestats.co.uk
Fault Fault Test Date Test Date/Time Reference MOT Test Reference
1 Rear exhaust mounting detached but system still adequately supported. Rear exhaust mounting detached but system still adequately supported. 20 June 2013 [09:12] 20/06/2013 145551373123 145551373123

MOT TEST: 15 May 2018 13:03:09 PASSED
MOT TEST: 15 May 2018 13:03:09 PASSED

This test (136839697213) was completed on the 15 May 2018 13:03:09 and PASSED the requirements for a valid MOT with 0 comments.

This test (136839697213) was completed on the 15 May 2018 13:03:09 and PASSED the requirements for a valid MOT with 0 comments.

Recorded mileage: 39,392

Recorded mileage: 39,392


MOT TEST: 23 May 2017 14:56:44 PASSED
MOT TEST: 23 May 2017 14:56:44 PASSED

This test (123164719194) was completed on the 23 May 2017 14:56:44 and PASSED the requirements for a valid MOT with 0 comments.

This test (123164719194) was completed on the 23 May 2017 14:56:44 and PASSED the requirements for a valid MOT with 0 comments.

Recorded mileage: 39,112

Recorded mileage: 39,112


MOT TEST: 01 June 2016 12:42:56 PASSED
MOT TEST: 01 June 2016 12:42:56 PASSED

This test (817075456348) was completed on the 01 June 2016 12:42:56 and PASSED the requirements for a valid MOT with 0 comments.

This test (817075456348) was completed on the 01 June 2016 12:42:56 and PASSED the requirements for a valid MOT with 0 comments.

Recorded mileage: 38,469

Recorded mileage: 38,469


MOT TEST: 23 May 2016 08:07:35 FAILED
MOT TEST: 23 May 2016 08:07:35 FAILED

This test (462401839542) was completed on the 23 May 2016 08:07:35 and FAILED the requirements for a valid MOT with 16 comments.

This test (462401839542) was completed on the 23 May 2016 08:07:35 and FAILED the requirements for a valid MOT with 16 comments.

Recorded mileage: 38,463

Recorded mileage: 38,463


ADVISORY

FAIL


MOT TEST: 12 June 2015 13:47:17 PASSED
MOT TEST: 12 June 2015 13:47:17 PASSED

This test (668143265104) was completed on the 12 June 2015 13:47:17 and PASSED the requirements for a valid MOT with 0 comments.

This test (668143265104) was completed on the 12 June 2015 13:47:17 and PASSED the requirements for a valid MOT with 0 comments.

Recorded mileage: 38,045

Recorded mileage: 38,045


MOT TEST: 11 June 2014 11:52:29 PASSED
MOT TEST: 11 June 2014 11:52:29 PASSED

This test (427612464134) was completed on the 11 June 2014 11:52:29 and PASSED the requirements for a valid MOT with 1 comments.

This test (427612464134) was completed on the 11 June 2014 11:52:29 and PASSED the requirements for a valid MOT with 1 comments.

Recorded mileage: 37,648

Recorded mileage: 37,648


ADVISORY


MOT TEST: 05 July 2013 13:46:45 PASSED
MOT TEST: 05 July 2013 13:46:45 PASSED

This test (827606883123) was completed on the 05 July 2013 13:46:45 and PASSED the requirements for a valid MOT with 0 comments.

This test (827606883123) was completed on the 05 July 2013 13:46:45 and PASSED the requirements for a valid MOT with 0 comments.

Recorded mileage: 37,129

Recorded mileage: 37,129


MOT TEST: 20 June 2013 09:12:17 FAILED
MOT TEST: 20 June 2013 09:12:17 FAILED

This test (145551373123) was completed on the 20 June 2013 09:12:17 and FAILED the requirements for a valid MOT with 9 comments.

This test (145551373123) was completed on the 20 June 2013 09:12:17 and FAILED the requirements for a valid MOT with 9 comments.

Recorded mileage: 37,125

Recorded mileage: 37,125


ADVISORY

FAIL

USER ENTERED


MOT TEST: 18 May 2012 08:45:53 FAILED
MOT TEST: 18 May 2012 08:45:53 FAILED

This test (196789032100) was completed on the 18 May 2012 08:45:53 and FAILED the requirements for a valid MOT with 6 comments.

This test (196789032100) was completed on the 18 May 2012 08:45:53 and FAILED the requirements for a valid MOT with 6 comments.

Recorded mileage: 37,025

Recorded mileage: 37,025


ADVISORY

FAIL