JY2 764


JY2764 is registered to a Blue 1933, Morris with a Petrol engine. It Failed its most recent MOT Test on the 04 August 2009

8 unique faults (9 Total) reported in its MOT History (2 Tests).

1 common/recurring faults.

50% (1) MOT Pass Rate and a 50% (1) MOT Failure Rate.

25,015 recorded miles.

JY2 764


JY2764 is registered to a Blue 1933, Morris with a Petrol engine. It Failed its most recent MOT Test on the 04 August 2009

8 unique faults (9 Total) reported in its MOT History (2 Tests).

1 common/recurring faults.

50% (1) MOT Pass Rate and a 50% (1) MOT Failure Rate.

25,015 recorded miles.

MOT PASS/Failure rate for JY2 764

all MOT test results for JY2 764 represented as a percentage
MOT PASS/Failure rate for JY2 764
all MOT test results for JY2 764 represented as a percentage

PERCENTAGE OF VEHICLE FAULTS WITH JY2 764

ALL REPORTED FAULTS, DISPLAYED BY PERCENTAGE OF OCCURRENCE DURING ALL MOT TESTS
PERCENTAGE OF VEHICLE FAULTS WITH JY2 764
ALL REPORTED FAULTS, DISPLAYED BY PERCENTAGE OF OCCURRENCE DURING ALL MOT TESTS
ADVISORY

FAIL

USER ENTERED

JY2 764 annual Faults by type

ALL REPORTED FAULTS, DISPLAYED over time and categorised by type
JY2 764 annual Faults by type
ALL REPORTED FAULTS, DISPLAYED over time and categorised by type

ALL JY2 764 ADVISORIES [4]

ALL ADVISORIES, ORDERED by OCCURRENCE DURING JY2 764's MOT HISTORY
ALL JY2 764 ADVISORIES [4]
ALL ADVISORIES, ORDERED by OCCURRENCE DURING JY2 764's MOT HISTORY
Advisory Faults | source www.vehiclestats.co.uk
Fault Fault Test Date Test Date/Time Reference MOT Test Reference
2 Brakes imbalanced requirements only just met. It would appear that the braking system requires adjustment or repair. (3.7.b.5b) Brakes imbalanced requirements only just met. It would appear that the braking system requires adjustment or repair. (3.7.b.5b) 04 August 2009 [10:31] 04/08/2009 23 July 2009 [14:58] 23/07/2009 802486419271 802486419271 251144509230 251144509230
1 Nearside front axle king pin has slight play in pin and/or bush (2.5.a.3a) Nearside front axle king pin has slight play in pin and/or bush (2.5.a.3a) 04 August 2009 [10:31] 04/08/2009 802486419271 802486419271
1 Nearside rear wheel bearing has slight play (2.6.2) Nearside rear wheel bearing has slight play (2.6.2) 04 August 2009 [10:31] 04/08/2009 802486419271 802486419271

ALL JY2 764 Failure Faults [4]

ALL Failure faults, ORDERED by OCCURRENCE DURING JY2 764's MOT HISTORY
ALL JY2 764 Failure Faults [4]
ALL Failure faults, ORDERED by OCCURRENCE DURING JY2 764's MOT HISTORY
Fail Faults | source www.vehiclestats.co.uk
Fault Fault Test Date Test Date/Time Reference MOT Test Reference
1 Nearside front brake hose has insufficient room to move, resulting in fouling on any part (3.6.b.4a) Nearside front brake hose has insufficient room to move, resulting in fouling on any part (3.6.b.4a) 23 July 2009 [14:58] 23/07/2009 251144509230 251144509230
1 Nearside axle king pin has excessive play in pin and/or bush adversely affecting the steering (2.5.a.3a) Nearside axle king pin has excessive play in pin and/or bush adversely affecting the steering (2.5.a.3a) 23 July 2009 [14:58] 23/07/2009 251144509230 251144509230
1 Nearside front front wheel bearing has excessive play (2.5.a.3c) Nearside front front wheel bearing has excessive play (2.5.a.3c) 23 July 2009 [14:58] 23/07/2009 251144509230 251144509230
1 Nearside rear rear wheel bearing has excessive play (2.6.2) Nearside rear rear wheel bearing has excessive play (2.6.2) 23 July 2009 [14:58] 23/07/2009 251144509230 251144509230

ALL JY2 764 User Entered Faults [1]

ALL User Entered faults, ORDERED by OCCURRENCE DURING JY2 764's MOT HISTORY
ALL JY2 764 User Entered Faults [1]
ALL User Entered faults, ORDERED by OCCURRENCE DURING JY2 764's MOT HISTORY
Fail Faults | source www.vehiclestats.co.uk
Fault Fault Test Date Test Date/Time Reference MOT Test Reference
1 All tyres starting to perish/split All tyres starting to perish/split 23 July 2009 [14:58] 23/07/2009 251144509230 251144509230

MOT TEST: 04 August 2009 10:31:37 PASSED
MOT TEST: 04 August 2009 10:31:37 PASSED

This test (802486419271) was completed on the 04 August 2009 10:31:37 and PASSED the requirements for a valid MOT with 3 comments.

This test (802486419271) was completed on the 04 August 2009 10:31:37 and PASSED the requirements for a valid MOT with 3 comments.

Recorded mileage: 25,015

Recorded mileage: 25,015


ADVISORY


MOT TEST: 23 July 2009 14:58:03 FAILED
MOT TEST: 23 July 2009 14:58:03 FAILED

This test (251144509230) was completed on the 23 July 2009 14:58:03 and FAILED the requirements for a valid MOT with 6 comments.

This test (251144509230) was completed on the 23 July 2009 14:58:03 and FAILED the requirements for a valid MOT with 6 comments.

Recorded mileage: 25,002

Recorded mileage: 25,002


ADVISORY

FAIL

USER ENTERED