JYD 323D


JYD323D is registered to a Blue 1966, Morris Minor 1000 with a Petrol engine. It Passed its most recent MOT Test on the 26 July 2018

30 unique faults (39 Total) reported in its MOT History (16 Tests).

6 common/recurring faults, the most frequent (5 times) is: Nearside Rear Tyre worn close to the legal limit (4.1.E.1).

69% (11) MOT Pass Rate and a 31% (5) MOT Failure Rate.

51,549 recorded miles.

JYD 323D


JYD323D is registered to a Blue 1966, Morris Minor 1000 with a Petrol engine. It Passed its most recent MOT Test on the 26 July 2018

30 unique faults (39 Total) reported in its MOT History (16 Tests).

6 common/recurring faults, the most frequent (5 times) is: Nearside Rear Tyre worn close to the legal limit (4.1.E.1).

69% (11) MOT Pass Rate and a 31% (5) MOT Failure Rate.

51,549 recorded miles.

MOT PASS/Failure rate for JYD 323D

all MOT test results for JYD 323D represented as a percentage
MOT PASS/Failure rate for JYD 323D
all MOT test results for JYD 323D represented as a percentage

PERCENTAGE OF VEHICLE FAULTS WITH JYD 323D

ALL REPORTED FAULTS, DISPLAYED BY PERCENTAGE OF OCCURRENCE DURING ALL MOT TESTS
PERCENTAGE OF VEHICLE FAULTS WITH JYD 323D
ALL REPORTED FAULTS, DISPLAYED BY PERCENTAGE OF OCCURRENCE DURING ALL MOT TESTS
ADVISORY

FAIL

USER ENTERED

PASS WITH RECTIFICATION

JYD 323D annual Faults by type

ALL REPORTED FAULTS, DISPLAYED over time and categorised by type
JYD 323D annual Faults by type
ALL REPORTED FAULTS, DISPLAYED over time and categorised by type

RECURRING FAULTS WITH JYD 323D

FAULTS THAT HAVE OCCURED MORE THAN ONCE DURING JYD 323D's MOT HISTORY
RECURRING FAULTS WITH JYD 323D
FAULTS THAT HAVE OCCURED MORE THAN ONCE DURING JYD 323D's MOT HISTORY
Fault Fault Test Date Test Date/Time Reference MOT Test Reference
5 Nearside rear tyre worn close to the legal limit (4.1.e.1) Nearside rear tyre worn close to the legal limit (4.1.e.1) 31 May 2017 [07:49] 31/05/2017 23 May 2017 [11:03] 23/05/2017 20 February 2015 [13:15] 20/02/2015 20 February 2015 [13:15] 20/02/2015 19 May 2010 [16:36] 19/05/2010 192790314907 192790314907 827958097155 827958097155 118721655459 118721655459 816761755015 816761755015 840669330120 840669330120
2 Offside rear tyre worn close to the legal limit (4.1.e.1) Offside rear tyre worn close to the legal limit (4.1.e.1) 20 February 2015 [13:15] 20/02/2015 20 February 2015 [13:15] 20/02/2015 118721655459 118721655459 816761755015 816761755015
2 Nearside rear shock absorber has a light misting of oil (2.7.3) Nearside rear shock absorber has a light misting of oil (2.7.3) 20 February 2015 [13:15] 20/02/2015 20 February 2015 [13:15] 20/02/2015 118721655459 118721655459 816761755015 816761755015
2 Offside rear shock absorber has a light misting of oil (2.7.3) Offside rear shock absorber has a light misting of oil (2.7.3) 20 February 2015 [13:15] 20/02/2015 20 February 2015 [13:15] 20/02/2015 118721655459 118721655459 816761755015 816761755015
2 Slight corrosion to rearside front inner and outer wings Slight corrosion to rearside front inner and outer wings 20 February 2015 [13:15] 20/02/2015 20 February 2015 [13:15] 20/02/2015 118721655459 118721655459 816761755015 816761755015
2 Offside front suspension has slight play in a lower suspension ball joint (2.5.b.1a) Offside front suspension has slight play in a lower suspension ball joint (2.5.b.1a) 14 May 2008 [12:27] 14/05/2008 07 May 2008 [15:42] 07/05/2008 840375538120 840375538120 754168628120 754168628120

ALL JYD 323D ADVISORIES [16]

ALL ADVISORIES, ORDERED by OCCURRENCE DURING JYD 323D's MOT HISTORY
ALL JYD 323D ADVISORIES [16]
ALL ADVISORIES, ORDERED by OCCURRENCE DURING JYD 323D's MOT HISTORY
Advisory Faults | source www.vehiclestats.co.uk
Fault Fault Test Date Test Date/Time Reference MOT Test Reference
5 Nearside rear tyre worn close to the legal limit (4.1.e.1) Nearside rear tyre worn close to the legal limit (4.1.e.1) 31 May 2017 [07:49] 31/05/2017 23 May 2017 [11:03] 23/05/2017 20 February 2015 [13:15] 20/02/2015 20 February 2015 [13:15] 20/02/2015 19 May 2010 [16:36] 19/05/2010 192790314907 192790314907 827958097155 827958097155 118721655459 118721655459 816761755015 816761755015 840669330120 840669330120
2 Offside rear tyre worn close to the legal limit (4.1.e.1) Offside rear tyre worn close to the legal limit (4.1.e.1) 20 February 2015 [13:15] 20/02/2015 20 February 2015 [13:15] 20/02/2015 118721655459 118721655459 816761755015 816761755015
2 Nearside rear shock absorber has a light misting of oil (2.7.3) Nearside rear shock absorber has a light misting of oil (2.7.3) 20 February 2015 [13:15] 20/02/2015 20 February 2015 [13:15] 20/02/2015 118721655459 118721655459 816761755015 816761755015
2 Offside rear shock absorber has a light misting of oil (2.7.3) Offside rear shock absorber has a light misting of oil (2.7.3) 20 February 2015 [13:15] 20/02/2015 20 February 2015 [13:15] 20/02/2015 118721655459 118721655459 816761755015 816761755015
2 Offside front suspension has slight play in a lower suspension ball joint (2.5.b.1a) Offside front suspension has slight play in a lower suspension ball joint (2.5.b.1a) 14 May 2008 [12:27] 14/05/2008 07 May 2008 [15:42] 07/05/2008 840375538120 840375538120 754168628120 754168628120
1 Steering system has slight free play detected at steering wheel (2.2.a.1a) Steering system has slight free play detected at steering wheel (2.2.a.1a) 16 May 2011 [13:30] 16/05/2011 546246631120 546246631120
1 Nearside front tyre worn close to the legal limit (4.1.e.1) Nearside front tyre worn close to the legal limit (4.1.e.1) 19 May 2010 [16:36] 19/05/2010 840669330120 840669330120
1 Offside rear leaf spring has slight side play at eye (anchor) (2.4.b.4) Offside rear leaf spring has slight side play at eye (anchor) (2.4.b.4) 19 May 2010 [16:36] 19/05/2010 840669330120 840669330120

ALL JYD 323D Failure Faults [17]

ALL Failure faults, ORDERED by OCCURRENCE DURING JYD 323D's MOT HISTORY
ALL JYD 323D Failure Faults [17]
ALL Failure faults, ORDERED by OCCURRENCE DURING JYD 323D's MOT HISTORY
Fail Faults | source www.vehiclestats.co.uk
Fault Fault Test Date Test Date/Time Reference MOT Test Reference
1 Front brakes imbalanced across an axle axle 1 (1.2.1 (b) (i)) Front brakes imbalanced across an axle axle 1 (1.2.1 (b) (i)) 24 July 2018 [09:20] 24/07/2018 359866329267 359866329267
1 Offside front brakes imbalanced across an axle (1.2.1 (b) (i)) Offside front brakes imbalanced across an axle (1.2.1 (b) (i)) 24 July 2018 [09:20] 24/07/2018 359866329267 359866329267
1 Offside front service brake effort inadequate at a wheel (1.2.1 (a) (i)) Offside front service brake effort inadequate at a wheel (1.2.1 (a) (i)) 24 July 2018 [09:20] 24/07/2018 359866329267 359866329267
1 Registration plate lamp inoperative in the case of a single lamp or all lamps (4.7.1 (b) (ii)) Registration plate lamp inoperative in the case of a single lamp or all lamps (4.7.1 (b) (ii)) 24 July 2018 [09:20] 24/07/2018 359866329267 359866329267
1 Horn not working (7.7 (a) (ii)) Horn not working (7.7 (a) (ii)) 24 July 2018 [09:20] 24/07/2018 359866329267 359866329267
1 Offside front fluid leak harmful to the environment or a risk to other road users (8.4.1 (a) (i)) Offside front fluid leak harmful to the environment or a risk to other road users (8.4.1 (a) (i)) 24 July 2018 [09:20] 24/07/2018 359866329267 359866329267
1 Nearside rear suspension component mounting prescribed area is excessively corroded (2.4.a.3) Nearside rear suspension component mounting prescribed area is excessively corroded (2.4.a.3) 23 May 2017 [11:03] 23/05/2017 827958097155 827958097155
1 Offside rear suspension component mounting prescribed area is excessively corroded (2.4.a.3) Offside rear suspension component mounting prescribed area is excessively corroded (2.4.a.3) 23 May 2017 [11:03] 23/05/2017 827958097155 827958097155
1 Offside vehicle structure has excessive corrosion, seriously affecting its strength within 30cm of the body mountings middle jacking point (6.1.b.2) Offside vehicle structure has excessive corrosion, seriously affecting its strength within 30cm of the body mountings middle jacking point (6.1.b.2) 23 May 2017 [11:03] 23/05/2017 827958097155 827958097155
1 Offside rear tyre tread depth below requirements of 1.6mm (4.1.e.1) Offside rear tyre tread depth below requirements of 1.6mm (4.1.e.1) 23 May 2017 [11:03] 23/05/2017 827958097155 827958097155
1 Offside front tyre tread depth below requirements of 1.6mm (4.1.e.1) Offside front tyre tread depth below requirements of 1.6mm (4.1.e.1) 23 May 2017 [11:03] 23/05/2017 827958097155 827958097155
1 Nearside front steering rack gaiter split (2.2.d.2d) Nearside front steering rack gaiter split (2.2.d.2d) 23 May 2017 [11:03] 23/05/2017 827958097155 827958097155
1 Offside front brake hose twisted (found during steering lock to lock check) (2.2.d.2b) Offside front brake hose twisted (found during steering lock to lock check) (2.2.d.2b) 23 May 2017 [11:03] 23/05/2017 827958097155 827958097155
1 Offside rear brake recording little or no effort (3.7.b.5a) Offside rear brake recording little or no effort (3.7.b.5a) 07 May 2008 [15:42] 07/05/2008 754168628120 754168628120
1 Offside rear parking brake recording little or no effort (3.7.b.6a) Offside rear parking brake recording little or no effort (3.7.b.6a) 07 May 2008 [15:42] 07/05/2008 754168628120 754168628120
1 Parking brake: efficiency below requirements (3.7.b.7) Parking brake: efficiency below requirements (3.7.b.7) 07 May 2008 [15:42] 07/05/2008 754168628120 754168628120
1 Nearside front suspension arm rubber bush deteriorated resulting in excessive movement (2.4.g.2) Nearside front suspension arm rubber bush deteriorated resulting in excessive movement (2.4.g.2) 19 May 2006 [14:20] 19/05/2006 593119336181 593119336181

ALL JYD 323D User Entered Faults [5]

ALL User Entered faults, ORDERED by OCCURRENCE DURING JYD 323D's MOT HISTORY
ALL JYD 323D User Entered Faults [5]
ALL User Entered faults, ORDERED by OCCURRENCE DURING JYD 323D's MOT HISTORY
Advisory Faults | source www.vehiclestats.co.uk
Fault Fault Test Date Test Date/Time Reference MOT Test Reference
2 Slight corrosion to rearside front inner and outer wings Slight corrosion to rearside front inner and outer wings 20 February 2015 [13:15] 20/02/2015 20 February 2015 [13:15] 20/02/2015 118721655459 118721655459 816761755015 816761755015
1 Slight corrosion in patches under vehicle. Slight corrosion in patches under vehicle. 16 May 2011 [13:30] 16/05/2011 546246631120 546246631120
1 Extra pressure required to operate brake lights Extra pressure required to operate brake lights 07 May 2008 [15:42] 07/05/2008 754168628120 754168628120
1 Slight in offside front lower trunnion Slight in offside front lower trunnion 25 May 2007 [14:45] 25/05/2007 584605147174 584605147174

ALL JYD 323D Pass With Rectification Faults [1]

ALL Pass With Rectification faults, ORDERED by OCCURRENCE DURING JYD 323D's MOT HISTORY
ALL JYD 323D Pass With Rectification Faults [1]
ALL Pass With Rectification faults, ORDERED by OCCURRENCE DURING JYD 323D's MOT HISTORY
Pass With Rectification Faults | source www.vehiclestats.co.uk
Fault Fault Test Date Test Date/Time Reference MOT Test Reference
1 Registration plate lamp not working (1.1.c.1d) Registration plate lamp not working (1.1.c.1d) 20 February 2015 [13:15] 20/02/2015 816761755015 816761755015

MOT TEST: 26 July 2018 11:47:47 PASSED
MOT TEST: 26 July 2018 11:47:47 PASSED

This test (744311322838) was completed on the 26 July 2018 11:47:47 and PASSED the requirements for a valid MOT with 0 comments.

This test (744311322838) was completed on the 26 July 2018 11:47:47 and PASSED the requirements for a valid MOT with 0 comments.

Recorded mileage: 51,549

Recorded mileage: 51,549


MOT TEST: 24 July 2018 09:20:09 FAILED
MOT TEST: 24 July 2018 09:20:09 FAILED

This test (359866329267) was completed on the 24 July 2018 09:20:09 and FAILED the requirements for a valid MOT with 6 comments.

This test (359866329267) was completed on the 24 July 2018 09:20:09 and FAILED the requirements for a valid MOT with 6 comments.

Recorded mileage: 51,538

Recorded mileage: 51,538


FAIL


MOT TEST: 31 May 2017 07:49:06 PASSED
MOT TEST: 31 May 2017 07:49:06 PASSED

This test (192790314907) was completed on the 31 May 2017 07:49:06 and PASSED the requirements for a valid MOT with 1 comments.

This test (192790314907) was completed on the 31 May 2017 07:49:06 and PASSED the requirements for a valid MOT with 1 comments.

Recorded mileage: 49,070

Recorded mileage: 49,070


ADVISORY


MOT TEST: 23 May 2017 11:03:40 FAILED
MOT TEST: 23 May 2017 11:03:40 FAILED

This test (827958097155) was completed on the 23 May 2017 11:03:40 and FAILED the requirements for a valid MOT with 8 comments.

This test (827958097155) was completed on the 23 May 2017 11:03:40 and FAILED the requirements for a valid MOT with 8 comments.

Recorded mileage: 49,056

Recorded mileage: 49,056


ADVISORY

FAIL


MOT TEST: 04 March 2016 10:21:06 PASSED
MOT TEST: 04 March 2016 10:21:06 PASSED

This test (413682410609) was completed on the 04 March 2016 10:21:06 and PASSED the requirements for a valid MOT with 0 comments.

This test (413682410609) was completed on the 04 March 2016 10:21:06 and PASSED the requirements for a valid MOT with 0 comments.

Recorded mileage: 47,433

Recorded mileage: 47,433


MOT TEST: 20 February 2015 13:15:03 PASSED
MOT TEST: 20 February 2015 13:15:03 PASSED

This test (118721655459) was completed on the 20 February 2015 13:15:03 and PASSED the requirements for a valid MOT with 5 comments.

This test (118721655459) was completed on the 20 February 2015 13:15:03 and PASSED the requirements for a valid MOT with 5 comments.

Recorded mileage: 47,129

Recorded mileage: 47,129


ADVISORY

USER ENTERED


MOT TEST: 20 February 2015 13:15:03 FAILED
MOT TEST: 20 February 2015 13:15:03 FAILED

This test (816761755015) was completed on the 20 February 2015 13:15:03 and FAILED the requirements for a valid MOT with 6 comments.

This test (816761755015) was completed on the 20 February 2015 13:15:03 and FAILED the requirements for a valid MOT with 6 comments.

Recorded mileage: 47,129

Recorded mileage: 47,129


ADVISORY

USER ENTERED

PASS WITH RECTIFICATION


MOT TEST: 06 June 2013 11:06:51 PASSED
MOT TEST: 06 June 2013 11:06:51 PASSED

This test (356097153166) was completed on the 06 June 2013 11:06:51 and PASSED the requirements for a valid MOT with 0 comments.

This test (356097153166) was completed on the 06 June 2013 11:06:51 and PASSED the requirements for a valid MOT with 0 comments.

Recorded mileage: 47,080

Recorded mileage: 47,080


MOT TEST: 16 May 2011 13:30:24 PASSED
MOT TEST: 16 May 2011 13:30:24 PASSED

This test (546246631120) was completed on the 16 May 2011 13:30:24 and PASSED the requirements for a valid MOT with 2 comments.

This test (546246631120) was completed on the 16 May 2011 13:30:24 and PASSED the requirements for a valid MOT with 2 comments.

Recorded mileage: 46,931

Recorded mileage: 46,931


ADVISORY

USER ENTERED


MOT TEST: 19 May 2010 16:36:43 PASSED
MOT TEST: 19 May 2010 16:36:43 PASSED

This test (840669330120) was completed on the 19 May 2010 16:36:43 and PASSED the requirements for a valid MOT with 3 comments.

This test (840669330120) was completed on the 19 May 2010 16:36:43 and PASSED the requirements for a valid MOT with 3 comments.

Recorded mileage: 41,155

Recorded mileage: 41,155


ADVISORY


MOT TEST: 13 May 2009 17:15:24 PASSED
MOT TEST: 13 May 2009 17:15:24 PASSED

This test (533673639100) was completed on the 13 May 2009 17:15:24 and PASSED the requirements for a valid MOT with 0 comments.

This test (533673639100) was completed on the 13 May 2009 17:15:24 and PASSED the requirements for a valid MOT with 0 comments.

Recorded mileage: 34,394

Recorded mileage: 34,394


MOT TEST: 14 May 2008 12:27:51 PASSED
MOT TEST: 14 May 2008 12:27:51 PASSED

This test (840375538120) was completed on the 14 May 2008 12:27:51 and PASSED the requirements for a valid MOT with 1 comments.

This test (840375538120) was completed on the 14 May 2008 12:27:51 and PASSED the requirements for a valid MOT with 1 comments.

Recorded mileage: 27,427

Recorded mileage: 27,427


ADVISORY


MOT TEST: 07 May 2008 15:42:13 FAILED
MOT TEST: 07 May 2008 15:42:13 FAILED

This test (754168628120) was completed on the 07 May 2008 15:42:13 and FAILED the requirements for a valid MOT with 5 comments.

This test (754168628120) was completed on the 07 May 2008 15:42:13 and FAILED the requirements for a valid MOT with 5 comments.

Recorded mileage: 27,314

Recorded mileage: 27,314


ADVISORY

FAIL

USER ENTERED


MOT TEST: 25 May 2007 14:45:16 PASSED
MOT TEST: 25 May 2007 14:45:16 PASSED

This test (584605147174) was completed on the 25 May 2007 14:45:16 and PASSED the requirements for a valid MOT with 1 comments.

This test (584605147174) was completed on the 25 May 2007 14:45:16 and PASSED the requirements for a valid MOT with 1 comments.

Recorded mileage: 20,849

Recorded mileage: 20,849


USER ENTERED


MOT TEST: 19 May 2006 16:44:54 PASSED
MOT TEST: 19 May 2006 16:44:54 PASSED

This test (402749136154) was completed on the 19 May 2006 16:44:54 and PASSED the requirements for a valid MOT with 0 comments.

This test (402749136154) was completed on the 19 May 2006 16:44:54 and PASSED the requirements for a valid MOT with 0 comments.

Recorded mileage: 12,822

Recorded mileage: 12,822


MOT TEST: 19 May 2006 14:20:14 FAILED
MOT TEST: 19 May 2006 14:20:14 FAILED

This test (593119336181) was completed on the 19 May 2006 14:20:14 and FAILED the requirements for a valid MOT with 1 comments.

This test (593119336181) was completed on the 19 May 2006 14:20:14 and FAILED the requirements for a valid MOT with 1 comments.

Recorded mileage: 12,822

Recorded mileage: 12,822


FAIL