JYD 614D


JYD614D is registered to a Grey 1966, Morris Minor 1000 with a Petrol engine. It Failed its most recent MOT Test on the 26 May 2017

4 unique faults (4 Total) reported in its MOT History (13 Tests).

0 common/recurring faults.

92% (12) MOT Pass Rate and a 8% (1) MOT Failure Rate.

727,170 recorded miles.

JYD 614D


JYD614D is registered to a Grey 1966, Morris Minor 1000 with a Petrol engine. It Failed its most recent MOT Test on the 26 May 2017

4 unique faults (4 Total) reported in its MOT History (13 Tests).

0 common/recurring faults.

92% (12) MOT Pass Rate and a 8% (1) MOT Failure Rate.

727,170 recorded miles.

MOT PASS/Failure rate for JYD 614D

all MOT test results for JYD 614D represented as a percentage
MOT PASS/Failure rate for JYD 614D
all MOT test results for JYD 614D represented as a percentage

PERCENTAGE OF VEHICLE FAULTS WITH JYD 614D

ALL REPORTED FAULTS, DISPLAYED BY PERCENTAGE OF OCCURRENCE DURING ALL MOT TESTS
PERCENTAGE OF VEHICLE FAULTS WITH JYD 614D
ALL REPORTED FAULTS, DISPLAYED BY PERCENTAGE OF OCCURRENCE DURING ALL MOT TESTS
ADVISORY

FAIL

USER ENTERED

JYD 614D annual Faults by type

ALL REPORTED FAULTS, DISPLAYED over time and categorised by type
JYD 614D annual Faults by type
ALL REPORTED FAULTS, DISPLAYED over time and categorised by type

ALL JYD 614D ADVISORIES [1]

ALL ADVISORIES, ORDERED by OCCURRENCE DURING JYD 614D's MOT HISTORY
ALL JYD 614D ADVISORIES [1]
ALL ADVISORIES, ORDERED by OCCURRENCE DURING JYD 614D's MOT HISTORY
Advisory Faults | source www.vehiclestats.co.uk
Fault Fault Test Date Test Date/Time Reference MOT Test Reference
1 Nearside front brake hose has slight corrosion to ferrules (3.6.b.4e) Nearside front brake hose has slight corrosion to ferrules (3.6.b.4e) 12 July 2013 [08:44] 12/07/2013 816753193135 816753193135

ALL JYD 614D Failure Faults [2]

ALL Failure faults, ORDERED by OCCURRENCE DURING JYD 614D's MOT HISTORY
ALL JYD 614D Failure Faults [2]
ALL Failure faults, ORDERED by OCCURRENCE DURING JYD 614D's MOT HISTORY
Fail Faults | source www.vehiclestats.co.uk
Fault Fault Test Date Test Date/Time Reference MOT Test Reference
1 Offside rear suspension spring mounting prescribed area is excessively corroded (2.4.a.3) Offside rear suspension spring mounting prescribed area is excessively corroded (2.4.a.3) 04 August 2006 [09:47] 04/08/2006 321256616279 321256616279
1 Offside front vehicle structure has excessive corrosion which adversely affects braking or steering (6.1.a.1) Offside front vehicle structure has excessive corrosion which adversely affects braking or steering (6.1.a.1) 04 August 2006 [09:47] 04/08/2006 321256616279 321256616279

ALL JYD 614D User Entered Faults [1]

ALL User Entered faults, ORDERED by OCCURRENCE DURING JYD 614D's MOT HISTORY
ALL JYD 614D User Entered Faults [1]
ALL User Entered faults, ORDERED by OCCURRENCE DURING JYD 614D's MOT HISTORY
User Entered Faults | source www.vehiclestats.co.uk
Fault Fault Test Date Test Date/Time Reference MOT Test Reference
1 Under body corrosion Under body corrosion 16 July 2014 [15:07] 16/07/2014 945017694139 945017694139

MOT TEST: 26 May 2017 12:45:38 PASSED
MOT TEST: 26 May 2017 12:45:38 PASSED

This test (121725390446) was completed on the 26 May 2017 12:45:38 and PASSED the requirements for a valid MOT with 0 comments.

This test (121725390446) was completed on the 26 May 2017 12:45:38 and PASSED the requirements for a valid MOT with 0 comments.

Recorded mileage: 75,407

Recorded mileage: 75,407


MOT TEST: 22 July 2016 12:23:44 PASSED
MOT TEST: 22 July 2016 12:23:44 PASSED

This test (320905691122) was completed on the 22 July 2016 12:23:44 and PASSED the requirements for a valid MOT with 0 comments.

This test (320905691122) was completed on the 22 July 2016 12:23:44 and PASSED the requirements for a valid MOT with 0 comments.

Recorded mileage: 75,306

Recorded mileage: 75,306


MOT TEST: 02 July 2015 14:44:22 PASSED
MOT TEST: 02 July 2015 14:44:22 PASSED

This test (239873585161) was completed on the 02 July 2015 14:44:22 and PASSED the requirements for a valid MOT with 0 comments.

This test (239873585161) was completed on the 02 July 2015 14:44:22 and PASSED the requirements for a valid MOT with 0 comments.

Recorded mileage: 75,127

Recorded mileage: 75,127


MOT TEST: 16 July 2014 15:07:17 PASSED
MOT TEST: 16 July 2014 15:07:17 PASSED

This test (945017694139) was completed on the 16 July 2014 15:07:17 and PASSED the requirements for a valid MOT with 1 comments.

This test (945017694139) was completed on the 16 July 2014 15:07:17 and PASSED the requirements for a valid MOT with 1 comments.

Recorded mileage: 74,977

Recorded mileage: 74,977


USER ENTERED


MOT TEST: 12 July 2013 08:44:15 PASSED
MOT TEST: 12 July 2013 08:44:15 PASSED

This test (816753193135) was completed on the 12 July 2013 08:44:15 and PASSED the requirements for a valid MOT with 1 comments.

This test (816753193135) was completed on the 12 July 2013 08:44:15 and PASSED the requirements for a valid MOT with 1 comments.

Recorded mileage: 74,664

Recorded mileage: 74,664


ADVISORY


MOT TEST: 09 July 2012 16:30:29 PASSED
MOT TEST: 09 July 2012 16:30:29 PASSED

This test (679271992149) was completed on the 09 July 2012 16:30:29 and PASSED the requirements for a valid MOT with 0 comments.

This test (679271992149) was completed on the 09 July 2012 16:30:29 and PASSED the requirements for a valid MOT with 0 comments.

Recorded mileage: 74,401

Recorded mileage: 74,401


MOT TEST: 07 July 2011 16:14:05 PASSED
MOT TEST: 07 July 2011 16:14:05 PASSED

This test (646218381137) was completed on the 07 July 2011 16:14:05 and PASSED the requirements for a valid MOT with 0 comments.

This test (646218381137) was completed on the 07 July 2011 16:14:05 and PASSED the requirements for a valid MOT with 0 comments.

Recorded mileage: 74,240

Recorded mileage: 74,240


MOT TEST: 15 July 2010 17:00:51 PASSED
MOT TEST: 15 July 2010 17:00:51 PASSED

This test (443416390176) was completed on the 15 July 2010 17:00:51 and PASSED the requirements for a valid MOT with 0 comments.

This test (443416390176) was completed on the 15 July 2010 17:00:51 and PASSED the requirements for a valid MOT with 0 comments.

Recorded mileage: 74,179

Recorded mileage: 74,179


MOT TEST: 07 August 2009 10:19:44 PASSED
MOT TEST: 07 August 2009 10:19:44 PASSED

This test (393359919263) was completed on the 07 August 2009 10:19:44 and PASSED the requirements for a valid MOT with 0 comments.

This test (393359919263) was completed on the 07 August 2009 10:19:44 and PASSED the requirements for a valid MOT with 0 comments.

Recorded mileage: 73,387

Recorded mileage: 73,387


MOT TEST: 09 August 2008 11:56:12 PASSED
MOT TEST: 09 August 2008 11:56:12 PASSED

This test (562042428221) was completed on the 09 August 2008 11:56:12 and PASSED the requirements for a valid MOT with 0 comments.

This test (562042428221) was completed on the 09 August 2008 11:56:12 and PASSED the requirements for a valid MOT with 0 comments.

Recorded mileage: 72,902

Recorded mileage: 72,902


MOT TEST: 30 July 2007 17:00:24 PASSED
MOT TEST: 30 July 2007 17:00:24 PASSED

This test (770081117248) was completed on the 30 July 2007 17:00:24 and PASSED the requirements for a valid MOT with 0 comments.

This test (770081117248) was completed on the 30 July 2007 17:00:24 and PASSED the requirements for a valid MOT with 0 comments.

Recorded mileage: 727,170

Recorded mileage: 727,170


MOT TEST: 18 August 2006 11:51:32 PASSED
MOT TEST: 18 August 2006 11:51:32 PASSED

This test (463470336224) was completed on the 18 August 2006 11:51:32 and PASSED the requirements for a valid MOT with 0 comments.

This test (463470336224) was completed on the 18 August 2006 11:51:32 and PASSED the requirements for a valid MOT with 0 comments.

Recorded mileage: 72,309

Recorded mileage: 72,309


MOT TEST: 04 August 2006 09:47:24 FAILED
MOT TEST: 04 August 2006 09:47:24 FAILED

This test (321256616279) was completed on the 04 August 2006 09:47:24 and FAILED the requirements for a valid MOT with 2 comments.

This test (321256616279) was completed on the 04 August 2006 09:47:24 and FAILED the requirements for a valid MOT with 2 comments.

Recorded mileage: 72,280

Recorded mileage: 72,280


FAIL