JYD 653D


JYD653D is registered to a Green 1966, Morris Minor 1000 with a Petrol engine. It Failed its most recent MOT Test on the 30 June 2017

54 unique faults (69 Total) reported in its MOT History (22 Tests).

9 common/recurring faults, the most frequent (6 times) is: Offside Rear Suspension spring mounting prescribed area is excessively corroded (2.4.A.3).

55% (12) MOT Pass Rate and a 45% (10) MOT Failure Rate.

67,753 recorded miles.

JYD 653D


JYD653D is registered to a Green 1966, Morris Minor 1000 with a Petrol engine. It Failed its most recent MOT Test on the 30 June 2017

54 unique faults (69 Total) reported in its MOT History (22 Tests).

9 common/recurring faults, the most frequent (6 times) is: Offside Rear Suspension spring mounting prescribed area is excessively corroded (2.4.A.3).

55% (12) MOT Pass Rate and a 45% (10) MOT Failure Rate.

67,753 recorded miles.

MOT PASS/Failure rate for JYD 653D

all MOT test results for JYD 653D represented as a percentage
MOT PASS/Failure rate for JYD 653D
all MOT test results for JYD 653D represented as a percentage

PERCENTAGE OF VEHICLE FAULTS WITH JYD 653D

ALL REPORTED FAULTS, DISPLAYED BY PERCENTAGE OF OCCURRENCE DURING ALL MOT TESTS
PERCENTAGE OF VEHICLE FAULTS WITH JYD 653D
ALL REPORTED FAULTS, DISPLAYED BY PERCENTAGE OF OCCURRENCE DURING ALL MOT TESTS
ADVISORY

FAIL

USER ENTERED

PASS WITH RECTIFICATION

JYD 653D annual Faults by type

ALL REPORTED FAULTS, DISPLAYED over time and categorised by type
JYD 653D annual Faults by type
ALL REPORTED FAULTS, DISPLAYED over time and categorised by type

RECURRING FAULTS WITH JYD 653D

FAULTS THAT HAVE OCCURED MORE THAN ONCE DURING JYD 653D's MOT HISTORY
RECURRING FAULTS WITH JYD 653D
FAULTS THAT HAVE OCCURED MORE THAN ONCE DURING JYD 653D's MOT HISTORY
Fault Fault Test Date Test Date/Time Reference MOT Test Reference
6 Offside rear suspension spring mounting prescribed area is excessively corroded (2.4.a.3) Offside rear suspension spring mounting prescribed area is excessively corroded (2.4.a.3) 19 March 2012 [12:14] 19/03/2012 29 March 2011 [14:04] 29/03/2011 17 March 2010 [16:06] 17/03/2010 13 March 2008 [11:38] 13/03/2008 17 March 2007 [08:54] 17/03/2007 05 December 2005 [09:44] 05/12/2005 916529672078 916529672078 676058781093 676058781093 470356270006 470356270006 153903678471 153903678471 543536277086 543536277086 880129235327 880129235327
2 Front windscreen washer provides insufficient washer liquid (8.2.3) Front windscreen washer provides insufficient washer liquid (8.2.3) 26 May 2017 [12:27] 26/05/2017 29 March 2011 [14:04] 29/03/2011 444196192994 444196192994 676058781093 676058781093
2 Service brake: efficiency below requirements (3.7.b.7) Service brake: efficiency below requirements (3.7.b.7) 26 May 2017 [12:27] 26/05/2017 19 March 2012 [12:14] 19/03/2012 444196192994 444196192994 916529672078 916529672078
2 Nearside front tyre worn close to the legal limit (4.1.e.1) Nearside front tyre worn close to the legal limit (4.1.e.1) 20 April 2015 [09:11] 20/04/2015 09 April 2015 [09:49] 09/04/2015 178000815181 178000815181 648219295020 648219295020
2 Nearside rear rear brake recording little or no effort (3.7.b.5a) Nearside rear rear brake recording little or no effort (3.7.b.5a) 19 March 2012 [12:14] 19/03/2012 05 December 2005 [09:44] 05/12/2005 916529672078 916529672078 880129235327 880129235327
2 Nearside rear lower suspension spring mounting prescribed area is excessively corroded (2.4.a.3) Nearside rear lower suspension spring mounting prescribed area is excessively corroded (2.4.a.3) 29 March 2011 [14:04] 29/03/2011 17 March 2010 [16:06] 17/03/2010 676058781093 676058781093 470356270006 470356270006
2 Parking brake: efficiency below requirements (3.7.b.7) Parking brake: efficiency below requirements (3.7.b.7) 29 March 2011 [14:04] 29/03/2011 05 December 2005 [09:44] 05/12/2005 676058781093 676058781093 880129235327 880129235327
2 Nearside front steering rack gaiter split (2.2.d.2d) Nearside front steering rack gaiter split (2.2.d.2d) 17 March 2010 [16:06] 17/03/2010 05 December 2005 [09:44] 05/12/2005 470356270006 470356270006 880129235327 880129235327
2 Offside front steering rack gaiter split (2.2.d.2d) Offside front steering rack gaiter split (2.2.d.2d) 13 March 2008 [11:38] 13/03/2008 05 December 2005 [09:44] 05/12/2005 153903678471 153903678471 880129235327 880129235327

ALL JYD 653D ADVISORIES [11]

ALL ADVISORIES, ORDERED by OCCURRENCE DURING JYD 653D's MOT HISTORY
ALL JYD 653D ADVISORIES [11]
ALL ADVISORIES, ORDERED by OCCURRENCE DURING JYD 653D's MOT HISTORY
Advisory Faults | source www.vehiclestats.co.uk
Fault Fault Test Date Test Date/Time Reference MOT Test Reference
2 Nearside front tyre worn close to the legal limit (4.1.e.1) Nearside front tyre worn close to the legal limit (4.1.e.1) 20 April 2015 [09:11] 20/04/2015 09 April 2015 [09:49] 09/04/2015 178000815181 178000815181 648219295020 648219295020
1 Nearside front tyre tread bald on outside edge Nearside front tyre tread bald on outside edge 30 June 2017 [09:56] 30/06/2017 999544852861 999544852861
1 Oil leaking from offside of rear axle Oil leaking from offside of rear axle 30 June 2017 [09:56] 30/06/2017 999544852861 999544852861
1 Corrosion in both rear wings/sills Corrosion in both rear wings/sills 30 June 2017 [09:56] 30/06/2017 999544852861 999544852861
1 Nearside front brake pipe slightly corroded (3.6.b.2c) Nearside front brake pipe slightly corroded (3.6.b.2c) 26 May 2017 [12:27] 26/05/2017 444196192994 444196192994
1 Offside front brake pipe slightly corroded (3.6.b.2c) Offside front brake pipe slightly corroded (3.6.b.2c) 26 May 2017 [12:27] 26/05/2017 444196192994 444196192994
1 Nearside front jacking point has corrosion Nearside front jacking point has corrosion 26 May 2017 [12:27] 26/05/2017 444196192994 444196192994
1 Offside front jacking point has corrosion Offside front jacking point has corrosion 26 May 2017 [12:27] 26/05/2017 444196192994 444196192994
1 Nearside rear tyre worn close to the legal limit (4.1.e.1) Nearside rear tyre worn close to the legal limit (4.1.e.1) 17 March 2009 [15:39] 17/03/2009 663956079036 663956079036
1 Offside rear tyre worn close to the legal limit (4.1.e.1) Offside rear tyre worn close to the legal limit (4.1.e.1) 17 March 2009 [15:39] 17/03/2009 663956079036 663956079036

ALL JYD 653D Failure Faults [56]

ALL Failure faults, ORDERED by OCCURRENCE DURING JYD 653D's MOT HISTORY
ALL JYD 653D Failure Faults [56]
ALL Failure faults, ORDERED by OCCURRENCE DURING JYD 653D's MOT HISTORY
Fail Faults | source www.vehiclestats.co.uk
Fault Fault Test Date Test Date/Time Reference MOT Test Reference
6 Offside rear suspension spring mounting prescribed area is excessively corroded (2.4.a.3) Offside rear suspension spring mounting prescribed area is excessively corroded (2.4.a.3) 19 March 2012 [12:14] 19/03/2012 29 March 2011 [14:04] 29/03/2011 17 March 2010 [16:06] 17/03/2010 13 March 2008 [11:38] 13/03/2008 17 March 2007 [08:54] 17/03/2007 05 December 2005 [09:44] 05/12/2005 916529672078 916529672078 676058781093 676058781093 470356270006 470356270006 153903678471 153903678471 543536277086 543536277086 880129235327 880129235327
2 Front windscreen washer provides insufficient washer liquid (8.2.3) Front windscreen washer provides insufficient washer liquid (8.2.3) 26 May 2017 [12:27] 26/05/2017 29 March 2011 [14:04] 29/03/2011 444196192994 444196192994 676058781093 676058781093
2 Service brake: efficiency below requirements (3.7.b.7) Service brake: efficiency below requirements (3.7.b.7) 26 May 2017 [12:27] 26/05/2017 19 March 2012 [12:14] 19/03/2012 444196192994 444196192994 916529672078 916529672078
2 Nearside rear rear brake recording little or no effort (3.7.b.5a) Nearside rear rear brake recording little or no effort (3.7.b.5a) 19 March 2012 [12:14] 19/03/2012 05 December 2005 [09:44] 05/12/2005 916529672078 916529672078 880129235327 880129235327
2 Nearside rear lower suspension spring mounting prescribed area is excessively corroded (2.4.a.3) Nearside rear lower suspension spring mounting prescribed area is excessively corroded (2.4.a.3) 29 March 2011 [14:04] 29/03/2011 17 March 2010 [16:06] 17/03/2010 676058781093 676058781093 470356270006 470356270006
2 Parking brake: efficiency below requirements (3.7.b.7) Parking brake: efficiency below requirements (3.7.b.7) 29 March 2011 [14:04] 29/03/2011 05 December 2005 [09:44] 05/12/2005 676058781093 676058781093 880129235327 880129235327
2 Nearside front steering rack gaiter split (2.2.d.2d) Nearside front steering rack gaiter split (2.2.d.2d) 17 March 2010 [16:06] 17/03/2010 05 December 2005 [09:44] 05/12/2005 470356270006 470356270006 880129235327 880129235327
2 Offside front steering rack gaiter split (2.2.d.2d) Offside front steering rack gaiter split (2.2.d.2d) 13 March 2008 [11:38] 13/03/2008 05 December 2005 [09:44] 05/12/2005 153903678471 153903678471 880129235327 880129235327
1 Offside rear seat belt anchorage prescribed area is excessively corroded floor (5.2.6) Offside rear seat belt anchorage prescribed area is excessively corroded floor (5.2.6) 26 May 2017 [12:27] 26/05/2017 444196192994 444196192994
1 Offside rear subframe mounting prescribed area is excessively corroded floor (2.4.a.3) Offside rear subframe mounting prescribed area is excessively corroded floor (2.4.a.3) 26 May 2017 [12:27] 26/05/2017 444196192994 444196192994
1 Nearside rear subframe mounting prescribed area is excessively corroded floor (2.4.a.3) Nearside rear subframe mounting prescribed area is excessively corroded floor (2.4.a.3) 26 May 2017 [12:27] 26/05/2017 444196192994 444196192994
1 Offside rear suspension component mounting prescribed area is excessively corroded leaf spring mount (outer wing ) (2.4.a.3) Offside rear suspension component mounting prescribed area is excessively corroded leaf spring mount (outer wing ) (2.4.a.3) 26 May 2017 [12:27] 26/05/2017 444196192994 444196192994
1 Nearside rear suspension component mounting prescribed area is excessively corroded leaf spring mount ( outer wing ) (2.4.a.3) Nearside rear suspension component mounting prescribed area is excessively corroded leaf spring mount ( outer wing ) (2.4.a.3) 26 May 2017 [12:27] 26/05/2017 444196192994 444196192994
1 Front brakes imbalanced across an axle (3.7.b.5b) Front brakes imbalanced across an axle (3.7.b.5b) 26 May 2017 [12:27] 26/05/2017 444196192994 444196192994
1 Windscreen washer provides insufficient washer liquid (8.2.3) Windscreen washer provides insufficient washer liquid (8.2.3) 04 April 2016 [12:03] 04/04/2016 103922688591 103922688591
1 Offside front tyre tread depth below requirements of 1.6mm (4.1.e.1) Offside front tyre tread depth below requirements of 1.6mm (4.1.e.1) 04 April 2016 [12:03] 04/04/2016 103922688591 103922688591
1 Nearside headlamp not working on dipped beam (1.7.5a) Nearside headlamp not working on dipped beam (1.7.5a) 09 April 2015 [09:49] 09/04/2015 648219295020 648219295020
1 Nearside rear suspension spring mounting prescribed area is excessively corroded (2.4.a.3) Nearside rear suspension spring mounting prescribed area is excessively corroded (2.4.a.3) 19 March 2012 [12:14] 19/03/2012 916529672078 916529672078
1 Brakes imbalanced across an axle (3.7.b.5b) Brakes imbalanced across an axle (3.7.b.5b) 19 March 2012 [12:14] 19/03/2012 916529672078 916529672078
1 Nearside rear parking brake recording little or no effort (3.7.b.6a) Nearside rear parking brake recording little or no effort (3.7.b.6a) 19 March 2012 [12:14] 19/03/2012 916529672078 916529672078
1 Offside front headlamp aim too high (1.8) Offside front headlamp aim too high (1.8) 29 March 2011 [14:04] 29/03/2011 676058781093 676058781093
1 Offside rear lower suspension spring mounting prescribed area is excessively corroded (2.4.a.3) Offside rear lower suspension spring mounting prescribed area is excessively corroded (2.4.a.3) 29 March 2011 [14:04] 29/03/2011 676058781093 676058781093
1 Nearside front lower suspension component mounting prescribed area is excessively corroded (2.4.a.3) Nearside front lower suspension component mounting prescribed area is excessively corroded (2.4.a.3) 29 March 2011 [14:04] 29/03/2011 676058781093 676058781093
1 Nearside front lower seat belt anchorage prescribed area is excessively corroded (5.2.6) Nearside front lower seat belt anchorage prescribed area is excessively corroded (5.2.6) 29 March 2011 [14:04] 29/03/2011 676058781093 676058781093
1 Nearside rear rear brake binding (3.7.b.1) Nearside rear rear brake binding (3.7.b.1) 29 March 2011 [14:04] 29/03/2011 676058781093 676058781093
1 Nearside rear rear parking brake recording little or no effort (3.7.b.6a) Nearside rear rear parking brake recording little or no effort (3.7.b.6a) 29 March 2011 [14:04] 29/03/2011 676058781093 676058781093
1 Front exhaust has a major leak of exhaust gases (7.1.2) Front exhaust has a major leak of exhaust gases (7.1.2) 17 March 2010 [16:06] 17/03/2010 470356270006 470356270006
1 Nearside rear tyre has a cut in excess of the requirements deep enough to reach the ply or cords (4.1.d.1a) Nearside rear tyre has a cut in excess of the requirements deep enough to reach the ply or cords (4.1.d.1a) 17 March 2010 [16:06] 17/03/2010 470356270006 470356270006
1 Offside rear tyre has a cut in excess of the requirements deep enough to reach the ply or cords (4.1.d.1a) Offside rear tyre has a cut in excess of the requirements deep enough to reach the ply or cords (4.1.d.1a) 17 March 2010 [16:06] 17/03/2010 470356270006 470356270006
1 Nearside front tyre tread depth below requirements of 1.6mm (4.1.e.1) Nearside front tyre tread depth below requirements of 1.6mm (4.1.e.1) 17 March 2010 [16:06] 17/03/2010 470356270006 470356270006
1 Offside rear tyre tread depth below requirements of 1.6mm (4.1.e.1) Offside rear tyre tread depth below requirements of 1.6mm (4.1.e.1) 17 March 2010 [16:06] 17/03/2010 470356270006 470356270006
1 Offside rear suspension component mounting prescribed area is excessively corroded (2.4.a.3) Offside rear suspension component mounting prescribed area is excessively corroded (2.4.a.3) 17 March 2010 [16:06] 17/03/2010 470356270006 470356270006
1 Offside front direction indicator adversely affected by the operation of another lamp (1.4.a.2h) Offside front direction indicator adversely affected by the operation of another lamp (1.4.a.2h) 13 March 2008 [11:38] 13/03/2008 153903678471 153903678471
1 Offside front front position lamp(s) adversely affected by the operation of another lamp (1.1.a.3f) Offside front front position lamp(s) adversely affected by the operation of another lamp (1.1.a.3f) 13 March 2008 [11:38] 13/03/2008 153903678471 153903678471
1 Centre exhaust has a major leak of exhaust gases (7.1.2) Centre exhaust has a major leak of exhaust gases (7.1.2) 13 March 2008 [11:38] 13/03/2008 153903678471 153903678471
1 Brake pedal anti-slip provision missing (3.3.a.1b) Brake pedal anti-slip provision missing (3.3.a.1b) 13 March 2008 [11:38] 13/03/2008 153903678471 153903678471
1 Nearside front suspension component mounting prescribed area is excessively corroded (2.4.a.3) Nearside front suspension component mounting prescribed area is excessively corroded (2.4.a.3) 13 March 2008 [11:38] 13/03/2008 153903678471 153903678471
1 Offside rear lower seat belt anchorage prescribed area is excessively corroded (5.2.6) Offside rear lower seat belt anchorage prescribed area is excessively corroded (5.2.6) 13 March 2008 [11:38] 13/03/2008 153903678471 153903678471
1 Offside front front position lamp(s) not working (1.1.a.3b) Offside front front position lamp(s) not working (1.1.a.3b) 05 December 2005 [09:44] 05/12/2005 880129235327 880129235327
1 Centre rear registration plate lamp not working (1.1.5c) Centre rear registration plate lamp not working (1.1.5c) 05 December 2005 [09:44] 05/12/2005 880129235327 880129235327
1 Offside front headlamp not working on dipped beam (1.7.5a) Offside front headlamp not working on dipped beam (1.7.5a) 05 December 2005 [09:44] 05/12/2005 880129235327 880129235327
1 Nearside rear direction indicator not working (1.4.a.2c) Nearside rear direction indicator not working (1.4.a.2c) 05 December 2005 [09:44] 05/12/2005 880129235327 880129235327

ALL JYD 653D User Entered Faults [1]

ALL User Entered faults, ORDERED by OCCURRENCE DURING JYD 653D's MOT HISTORY
ALL JYD 653D User Entered Faults [1]
ALL User Entered faults, ORDERED by OCCURRENCE DURING JYD 653D's MOT HISTORY
Fail Faults | source www.vehiclestats.co.uk
Fault Fault Test Date Test Date/Time Reference MOT Test Reference
1 Off side and near side frount wings corroded Off side and near side frount wings corroded 29 March 2011 [14:04] 29/03/2011 676058781093 676058781093

ALL JYD 653D Pass With Rectification Faults [1]

ALL Pass With Rectification faults, ORDERED by OCCURRENCE DURING JYD 653D's MOT HISTORY
ALL JYD 653D Pass With Rectification Faults [1]
ALL Pass With Rectification faults, ORDERED by OCCURRENCE DURING JYD 653D's MOT HISTORY
Pass With Rectification Faults | source www.vehiclestats.co.uk
Fault Fault Test Date Test Date/Time Reference MOT Test Reference
1 Rear registration plate lamp not working (1.1.c.1d) Rear registration plate lamp not working (1.1.c.1d) 08 April 2013 [10:01] 08/04/2013 797548093040 797548093040

MOT TEST: 30 June 2017 09:56:14 PASSED
MOT TEST: 30 June 2017 09:56:14 PASSED

This test (999544852861) was completed on the 30 June 2017 09:56:14 and PASSED the requirements for a valid MOT with 3 comments.

This test (999544852861) was completed on the 30 June 2017 09:56:14 and PASSED the requirements for a valid MOT with 3 comments.

Recorded mileage: 67,753

Recorded mileage: 67,753


ADVISORY


MOT TEST: 26 May 2017 12:27:22 FAILED
MOT TEST: 26 May 2017 12:27:22 FAILED

This test (444196192994) was completed on the 26 May 2017 12:27:22 and FAILED the requirements for a valid MOT with 12 comments.

This test (444196192994) was completed on the 26 May 2017 12:27:22 and FAILED the requirements for a valid MOT with 12 comments.

Recorded mileage: 67,743

Recorded mileage: 67,743


ADVISORY

FAIL


MOT TEST: 08 April 2016 14:07:55 PASSED
MOT TEST: 08 April 2016 14:07:55 PASSED

This test (613560085677) was completed on the 08 April 2016 14:07:55 and PASSED the requirements for a valid MOT with 0 comments.

This test (613560085677) was completed on the 08 April 2016 14:07:55 and PASSED the requirements for a valid MOT with 0 comments.

Recorded mileage: 67,329

Recorded mileage: 67,329


MOT TEST: 04 April 2016 12:03:56 FAILED
MOT TEST: 04 April 2016 12:03:56 FAILED

This test (103922688591) was completed on the 04 April 2016 12:03:56 and FAILED the requirements for a valid MOT with 2 comments.

This test (103922688591) was completed on the 04 April 2016 12:03:56 and FAILED the requirements for a valid MOT with 2 comments.

Recorded mileage: 67,329

Recorded mileage: 67,329


FAIL


MOT TEST: 20 April 2015 09:11:17 PASSED
MOT TEST: 20 April 2015 09:11:17 PASSED

This test (178000815181) was completed on the 20 April 2015 09:11:17 and PASSED the requirements for a valid MOT with 1 comments.

This test (178000815181) was completed on the 20 April 2015 09:11:17 and PASSED the requirements for a valid MOT with 1 comments.

Recorded mileage: 66,986

Recorded mileage: 66,986


ADVISORY


MOT TEST: 09 April 2015 09:49:48 FAILED
MOT TEST: 09 April 2015 09:49:48 FAILED

This test (648219295020) was completed on the 09 April 2015 09:49:48 and FAILED the requirements for a valid MOT with 2 comments.

This test (648219295020) was completed on the 09 April 2015 09:49:48 and FAILED the requirements for a valid MOT with 2 comments.

Recorded mileage: 66,986

Recorded mileage: 66,986


ADVISORY

FAIL


MOT TEST: 11 April 2014 11:37:39 PASSED
MOT TEST: 11 April 2014 11:37:39 PASSED

This test (437561204161) was completed on the 11 April 2014 11:37:39 and PASSED the requirements for a valid MOT with 0 comments.

This test (437561204161) was completed on the 11 April 2014 11:37:39 and PASSED the requirements for a valid MOT with 0 comments.

Recorded mileage: 66,098

Recorded mileage: 66,098


MOT TEST: 08 April 2013 10:01:04 PASSED
MOT TEST: 08 April 2013 10:01:04 PASSED

This test (676648593064) was completed on the 08 April 2013 10:01:04 and PASSED the requirements for a valid MOT with 0 comments.

This test (676648593064) was completed on the 08 April 2013 10:01:04 and PASSED the requirements for a valid MOT with 0 comments.

Recorded mileage: 62,289

Recorded mileage: 62,289


MOT TEST: 08 April 2013 10:01:04 FAILED
MOT TEST: 08 April 2013 10:01:04 FAILED

This test (797548093040) was completed on the 08 April 2013 10:01:04 and FAILED the requirements for a valid MOT with 1 comments.

This test (797548093040) was completed on the 08 April 2013 10:01:04 and FAILED the requirements for a valid MOT with 1 comments.

Recorded mileage: 62,289

Recorded mileage: 62,289


PASS WITH RECTIFICATION


MOT TEST: 21 March 2012 13:11:42 PASSED
MOT TEST: 21 March 2012 13:11:42 PASSED

This test (475271082035) was completed on the 21 March 2012 13:11:42 and PASSED the requirements for a valid MOT with 0 comments.

This test (475271082035) was completed on the 21 March 2012 13:11:42 and PASSED the requirements for a valid MOT with 0 comments.

Recorded mileage: 60,441

Recorded mileage: 60,441


MOT TEST: 19 March 2012 12:14:42 FAILED
MOT TEST: 19 March 2012 12:14:42 FAILED

This test (916529672078) was completed on the 19 March 2012 12:14:42 and FAILED the requirements for a valid MOT with 6 comments.

This test (916529672078) was completed on the 19 March 2012 12:14:42 and FAILED the requirements for a valid MOT with 6 comments.

Recorded mileage: 60,441

Recorded mileage: 60,441


FAIL


MOT TEST: 08 April 2011 13:34:17 PASSED
MOT TEST: 08 April 2011 13:34:17 PASSED

This test (427938491052) was completed on the 08 April 2011 13:34:17 and PASSED the requirements for a valid MOT with 0 comments.

This test (427938491052) was completed on the 08 April 2011 13:34:17 and PASSED the requirements for a valid MOT with 0 comments.

Recorded mileage: 57,566

Recorded mileage: 57,566


MOT TEST: 29 March 2011 14:04:56 FAILED
MOT TEST: 29 March 2011 14:04:56 FAILED

This test (676058781093) was completed on the 29 March 2011 14:04:56 and FAILED the requirements for a valid MOT with 11 comments.

This test (676058781093) was completed on the 29 March 2011 14:04:56 and FAILED the requirements for a valid MOT with 11 comments.

Recorded mileage: 57,541

Recorded mileage: 57,541


FAIL

USER ENTERED


MOT TEST: 31 March 2010 14:08:07 PASSED
MOT TEST: 31 March 2010 14:08:07 PASSED

This test (653220990068) was completed on the 31 March 2010 14:08:07 and PASSED the requirements for a valid MOT with 0 comments.

This test (653220990068) was completed on the 31 March 2010 14:08:07 and PASSED the requirements for a valid MOT with 0 comments.

Recorded mileage: 56,723

Recorded mileage: 56,723


MOT TEST: 17 March 2010 16:06:46 FAILED
MOT TEST: 17 March 2010 16:06:46 FAILED

This test (470356270006) was completed on the 17 March 2010 16:06:46 and FAILED the requirements for a valid MOT with 9 comments.

This test (470356270006) was completed on the 17 March 2010 16:06:46 and FAILED the requirements for a valid MOT with 9 comments.

Recorded mileage: 56,604

Recorded mileage: 56,604


FAIL


MOT TEST: 17 March 2009 15:39:52 PASSED
MOT TEST: 17 March 2009 15:39:52 PASSED

This test (663956079036) was completed on the 17 March 2009 15:39:52 and PASSED the requirements for a valid MOT with 2 comments.

This test (663956079036) was completed on the 17 March 2009 15:39:52 and PASSED the requirements for a valid MOT with 2 comments.

Recorded mileage: 55,607

Recorded mileage: 55,607


ADVISORY


MOT TEST: 19 March 2008 14:41:43 PASSED
MOT TEST: 19 March 2008 14:41:43 PASSED

This test (761539578063) was completed on the 19 March 2008 14:41:43 and PASSED the requirements for a valid MOT with 0 comments.

This test (761539578063) was completed on the 19 March 2008 14:41:43 and PASSED the requirements for a valid MOT with 0 comments.

Recorded mileage: 54,574

Recorded mileage: 54,574


MOT TEST: 13 March 2008 11:38:29 FAILED
MOT TEST: 13 March 2008 11:38:29 FAILED

This test (153903678471) was completed on the 13 March 2008 11:38:29 and FAILED the requirements for a valid MOT with 10 comments.

This test (153903678471) was completed on the 13 March 2008 11:38:29 and FAILED the requirements for a valid MOT with 10 comments.

Recorded mileage: 54,574

Recorded mileage: 54,574


FAIL


MOT TEST: 17 March 2007 11:04:30 PASSED
MOT TEST: 17 March 2007 11:04:30 PASSED

This test (220886177014) was completed on the 17 March 2007 11:04:30 and PASSED the requirements for a valid MOT with 0 comments.

This test (220886177014) was completed on the 17 March 2007 11:04:30 and PASSED the requirements for a valid MOT with 0 comments.

Recorded mileage: 53,171

Recorded mileage: 53,171


MOT TEST: 17 March 2007 08:54:36 FAILED
MOT TEST: 17 March 2007 08:54:36 FAILED

This test (543536277086) was completed on the 17 March 2007 08:54:36 and FAILED the requirements for a valid MOT with 1 comments.

This test (543536277086) was completed on the 17 March 2007 08:54:36 and FAILED the requirements for a valid MOT with 1 comments.

Recorded mileage: 53,171

Recorded mileage: 53,171


FAIL


MOT TEST: 10 December 2005 17:04:27 PASSED
MOT TEST: 10 December 2005 17:04:27 PASSED

This test (692874645373) was completed on the 10 December 2005 17:04:27 and PASSED the requirements for a valid MOT with 0 comments.

This test (692874645373) was completed on the 10 December 2005 17:04:27 and PASSED the requirements for a valid MOT with 0 comments.

Recorded mileage: 48,327

Recorded mileage: 48,327


MOT TEST: 05 December 2005 09:44:03 FAILED
MOT TEST: 05 December 2005 09:44:03 FAILED

This test (880129235327) was completed on the 05 December 2005 09:44:03 and FAILED the requirements for a valid MOT with 9 comments.

This test (880129235327) was completed on the 05 December 2005 09:44:03 and FAILED the requirements for a valid MOT with 9 comments.

Recorded mileage: 48,291

Recorded mileage: 48,291


FAIL