JYD 822D


JYD822D is registered to a Blue 1966, Morris Minor with a Petrol engine. It Passed its most recent MOT Test on the 03 July 2018

29 unique faults (35 Total) reported in its MOT History (16 Tests).

6 common/recurring faults, the most frequent (2 times) is: Brakes imbalanced across an axle (3.7.B.5b).

56% (9) MOT Pass Rate and a 44% (7) MOT Failure Rate.

12,643 recorded miles.

JYD 822D


JYD822D is registered to a Blue 1966, Morris Minor with a Petrol engine. It Passed its most recent MOT Test on the 03 July 2018

29 unique faults (35 Total) reported in its MOT History (16 Tests).

6 common/recurring faults, the most frequent (2 times) is: Brakes imbalanced across an axle (3.7.B.5b).

56% (9) MOT Pass Rate and a 44% (7) MOT Failure Rate.

12,643 recorded miles.

MOT PASS/Failure rate for JYD 822D

all MOT test results for JYD 822D represented as a percentage
MOT PASS/Failure rate for JYD 822D
all MOT test results for JYD 822D represented as a percentage

PERCENTAGE OF VEHICLE FAULTS WITH JYD 822D

ALL REPORTED FAULTS, DISPLAYED BY PERCENTAGE OF OCCURRENCE DURING ALL MOT TESTS
PERCENTAGE OF VEHICLE FAULTS WITH JYD 822D
ALL REPORTED FAULTS, DISPLAYED BY PERCENTAGE OF OCCURRENCE DURING ALL MOT TESTS
ADVISORY

FAIL

USER ENTERED

PASS WITH RECTIFICATION

JYD 822D annual Faults by type

ALL REPORTED FAULTS, DISPLAYED over time and categorised by type
JYD 822D annual Faults by type
ALL REPORTED FAULTS, DISPLAYED over time and categorised by type

RECURRING FAULTS WITH JYD 822D

FAULTS THAT HAVE OCCURED MORE THAN ONCE DURING JYD 822D's MOT HISTORY
RECURRING FAULTS WITH JYD 822D
FAULTS THAT HAVE OCCURED MORE THAN ONCE DURING JYD 822D's MOT HISTORY
Fault Fault Test Date Test Date/Time Reference MOT Test Reference
2 Brakes imbalanced across an axle (3.7.b.5b) Brakes imbalanced across an axle (3.7.b.5b) 01 September 2015 [14:57] 01/09/2015 04 January 2008 [10:36] 04/01/2008 577479575174 577479575174 112004808453 112004808453
2 Brake pipe slightly corroded (3.6.b.2c) Brake pipe slightly corroded (3.6.b.2c) 27 August 2014 [12:55] 27/08/2014 27 August 2014 [12:55] 27/08/2014 579499734250 579499734250 689699034271 689699034271
2 Exhaust rusty and slightly blowing Exhaust rusty and slightly blowing 31 July 2013 [09:09] 31/07/2013 30 July 2013 [12:02] 30/07/2013 328482713415 328482713415 649581313233 649581313233
2 Rear x member behind rear leaf springs sounding thin Rear x member behind rear leaf springs sounding thin 31 July 2013 [09:09] 31/07/2013 30 July 2013 [12:02] 30/07/2013 328482713415 328482713415 649581313233 649581313233
2 N/s/f brake pipe rusty (not pitted) N/s/f brake pipe rusty (not pitted) 31 July 2013 [09:09] 31/07/2013 30 July 2013 [12:02] 30/07/2013 328482713415 328482713415 649581313233 649581313233
2 N/s/f top suspension bush slight play N/s/f top suspension bush slight play 31 July 2013 [09:09] 31/07/2013 30 July 2013 [12:02] 30/07/2013 328482713415 328482713415 649581313233 649581313233

ALL JYD 822D ADVISORIES [7]

ALL ADVISORIES, ORDERED by OCCURRENCE DURING JYD 822D's MOT HISTORY
ALL JYD 822D ADVISORIES [7]
ALL ADVISORIES, ORDERED by OCCURRENCE DURING JYD 822D's MOT HISTORY
Advisory Faults | source www.vehiclestats.co.uk
Fault Fault Test Date Test Date/Time Reference MOT Test Reference
2 Brake pipe slightly corroded (3.6.b.2c) Brake pipe slightly corroded (3.6.b.2c) 27 August 2014 [12:55] 27/08/2014 27 August 2014 [12:55] 27/08/2014 579499734250 579499734250 689699034271 689699034271
1 Front front brake fluctuating, but not excessively both (3.7.b.3) Front front brake fluctuating, but not excessively both (3.7.b.3) 01 September 2015 [14:57] 01/09/2015 577479575174 577479575174
1 Front brake pipe slightly corroded all front pipes (3.6.b.2c) Front brake pipe slightly corroded all front pipes (3.6.b.2c) 01 September 2015 [14:57] 01/09/2015 577479575174 577479575174
1 Rear brake pipe slightly corroded axle pipes (3.6.b.2c) Rear brake pipe slightly corroded axle pipes (3.6.b.2c) 01 September 2015 [14:57] 01/09/2015 577479575174 577479575174
1 Rear tyre worn close to the legal limit both rear plus age cracking (4.1.e.1) Rear tyre worn close to the legal limit both rear plus age cracking (4.1.e.1) 01 September 2015 [14:57] 01/09/2015 577479575174 577479575174
1 Rear both rear tyres age cracked Rear both rear tyres age cracked 01 September 2015 [14:57] 01/09/2015 577479575174 577479575174

ALL JYD 822D Failure Faults [19]

ALL Failure faults, ORDERED by OCCURRENCE DURING JYD 822D's MOT HISTORY
ALL JYD 822D Failure Faults [19]
ALL Failure faults, ORDERED by OCCURRENCE DURING JYD 822D's MOT HISTORY
Fail Faults | source www.vehiclestats.co.uk
Fault Fault Test Date Test Date/Time Reference MOT Test Reference
2 Brakes imbalanced across an axle (3.7.b.5b) Brakes imbalanced across an axle (3.7.b.5b) 01 September 2015 [14:57] 01/09/2015 04 January 2008 [10:36] 04/01/2008 577479575174 577479575174 112004808453 112004808453
1 Stop lamp(s) all not working (4.3.1 (a) (iii)) Stop lamp(s) all not working (4.3.1 (a) (iii)) 03 July 2018 [08:40] 03/07/2018 902690015637 902690015637
1 Windscreen washer not working (3.5 (a)) Windscreen washer not working (3.5 (a)) 03 July 2018 [08:40] 03/07/2018 902690015637 902690015637
1 Speedometer cannot be illuminated (7.8 (c) (ii)) Speedometer cannot be illuminated (7.8 (c) (ii)) 30 May 2018 [10:28] 30/05/2018 335987985649 335987985649
1 Headlamp aim not tested (4.1.2 (b)) Headlamp aim not tested (4.1.2 (b)) 30 May 2018 [10:28] 30/05/2018 335987985649 335987985649
1 Nearside headlamp not working on main beam (4.1.1 (a) (ii)) Nearside headlamp not working on main beam (4.1.1 (a) (ii)) 30 May 2018 [10:28] 30/05/2018 335987985649 335987985649
1 Offside headlamp not working on main beam (4.1.1 (a) (ii)) Offside headlamp not working on main beam (4.1.1 (a) (ii)) 30 May 2018 [10:28] 30/05/2018 335987985649 335987985649
1 Registration plate lamp inoperative in the case of a single lamp or all lamps (4.7.1 (b) (ii)) Registration plate lamp inoperative in the case of a single lamp or all lamps (4.7.1 (b) (ii)) 30 May 2018 [10:28] 30/05/2018 335987985649 335987985649
1 Offside headlamp aim too high (1.8) Offside headlamp aim too high (1.8) 25 October 2016 [11:16] 25/10/2016 309770507705 309770507705
1 Nearside headlamp aim too high (1.8) Nearside headlamp aim too high (1.8) 25 October 2016 [11:16] 25/10/2016 309770507705 309770507705
1 Nearside headlamp not working on dipped beam (1.7.5a) Nearside headlamp not working on dipped beam (1.7.5a) 25 October 2016 [11:16] 25/10/2016 309770507705 309770507705
1 Offside front front brake binding (3.7.b.1) Offside front front brake binding (3.7.b.1) 01 September 2015 [14:57] 01/09/2015 577479575174 577479575174
1 Brake pipe inadequately clipped front to rear chaffing on clutch mechanism (3.6.b.1) Brake pipe inadequately clipped front to rear chaffing on clutch mechanism (3.6.b.1) 01 September 2015 [14:57] 01/09/2015 577479575174 577479575174
1 Centre exhaust has a major leak of exhaust gases (7.1.2) Centre exhaust has a major leak of exhaust gases (7.1.2) 01 September 2015 [14:57] 01/09/2015 577479575174 577479575174
1 Nearside windscreen washer provides insufficient washer liquid (8.2.3) Nearside windscreen washer provides insufficient washer liquid (8.2.3) 01 September 2015 [14:57] 01/09/2015 577479575174 577479575174
1 Nearside steering rack gaiter split (2.2.d.2d) Nearside steering rack gaiter split (2.2.d.2d) 30 July 2013 [12:02] 30/07/2013 649581313233 649581313233
1 Nearside rear brake binding (3.7.b.1) Nearside rear brake binding (3.7.b.1) 04 January 2008 [10:36] 04/01/2008 112004808453 112004808453
1 Offside front brake binding (3.7.b.1) Offside front brake binding (3.7.b.1) 04 January 2008 [10:36] 04/01/2008 112004808453 112004808453

ALL JYD 822D User Entered Faults [8]

ALL User Entered faults, ORDERED by OCCURRENCE DURING JYD 822D's MOT HISTORY
ALL JYD 822D User Entered Faults [8]
ALL User Entered faults, ORDERED by OCCURRENCE DURING JYD 822D's MOT HISTORY
User Entered Faults | source www.vehiclestats.co.uk
Fault Fault Test Date Test Date/Time Reference MOT Test Reference
2 Exhaust rusty and slightly blowing Exhaust rusty and slightly blowing 31 July 2013 [09:09] 31/07/2013 30 July 2013 [12:02] 30/07/2013 328482713415 328482713415 649581313233 649581313233
2 Rear x member behind rear leaf springs sounding thin Rear x member behind rear leaf springs sounding thin 31 July 2013 [09:09] 31/07/2013 30 July 2013 [12:02] 30/07/2013 328482713415 328482713415 649581313233 649581313233
2 N/s/f brake pipe rusty (not pitted) N/s/f brake pipe rusty (not pitted) 31 July 2013 [09:09] 31/07/2013 30 July 2013 [12:02] 30/07/2013 328482713415 328482713415 649581313233 649581313233
2 N/s/f top suspension bush slight play N/s/f top suspension bush slight play 31 July 2013 [09:09] 31/07/2013 30 July 2013 [12:02] 30/07/2013 328482713415 328482713415 649581313233 649581313233

ALL JYD 822D Pass With Rectification Faults [1]

ALL Pass With Rectification faults, ORDERED by OCCURRENCE DURING JYD 822D's MOT HISTORY
ALL JYD 822D Pass With Rectification Faults [1]
ALL Pass With Rectification faults, ORDERED by OCCURRENCE DURING JYD 822D's MOT HISTORY
Pass With Rectification Faults | source www.vehiclestats.co.uk
Fault Fault Test Date Test Date/Time Reference MOT Test Reference
1 Rear suspension component mounting prescribed area is excessively corroded (2.4.a.3) Rear suspension component mounting prescribed area is excessively corroded (2.4.a.3) 27 August 2014 [12:55] 27/08/2014 689699034271 689699034271

MOT TEST: 03 July 2018 13:51:12 PASSED
MOT TEST: 03 July 2018 13:51:12 PASSED

This test (486010638635) was completed on the 03 July 2018 13:51:12 and PASSED the requirements for a valid MOT with 0 comments.

This test (486010638635) was completed on the 03 July 2018 13:51:12 and PASSED the requirements for a valid MOT with 0 comments.

Recorded mileage: 12,643

Recorded mileage: 12,643


MOT TEST: 03 July 2018 08:40:21 FAILED
MOT TEST: 03 July 2018 08:40:21 FAILED

This test (902690015637) was completed on the 03 July 2018 08:40:21 and FAILED the requirements for a valid MOT with 2 comments.

This test (902690015637) was completed on the 03 July 2018 08:40:21 and FAILED the requirements for a valid MOT with 2 comments.

Recorded mileage: 12,637

Recorded mileage: 12,637


FAIL


MOT TEST: 30 May 2018 10:28:26 FAILED
MOT TEST: 30 May 2018 10:28:26 FAILED

This test (335987985649) was completed on the 30 May 2018 10:28:26 and FAILED the requirements for a valid MOT with 5 comments.

This test (335987985649) was completed on the 30 May 2018 10:28:26 and FAILED the requirements for a valid MOT with 5 comments.

Recorded mileage: 12,613

Recorded mileage: 12,613


FAIL


MOT TEST: 25 October 2016 14:22:55 PASSED
MOT TEST: 25 October 2016 14:22:55 PASSED

This test (606108380808) was completed on the 25 October 2016 14:22:55 and PASSED the requirements for a valid MOT with 0 comments.

This test (606108380808) was completed on the 25 October 2016 14:22:55 and PASSED the requirements for a valid MOT with 0 comments.

Recorded mileage: 12,610

Recorded mileage: 12,610


MOT TEST: 25 October 2016 11:16:31 FAILED
MOT TEST: 25 October 2016 11:16:31 FAILED

This test (309770507705) was completed on the 25 October 2016 11:16:31 and FAILED the requirements for a valid MOT with 3 comments.

This test (309770507705) was completed on the 25 October 2016 11:16:31 and FAILED the requirements for a valid MOT with 3 comments.

Recorded mileage: 12,610

Recorded mileage: 12,610


FAIL


MOT TEST: 04 November 2015 16:16:06 PASSED
MOT TEST: 04 November 2015 16:16:06 PASSED

This test (652408342091) was completed on the 04 November 2015 16:16:06 and PASSED the requirements for a valid MOT with 0 comments.

This test (652408342091) was completed on the 04 November 2015 16:16:06 and PASSED the requirements for a valid MOT with 0 comments.

Recorded mileage: 12,434

Recorded mileage: 12,434


MOT TEST: 01 September 2015 14:57:26 FAILED
MOT TEST: 01 September 2015 14:57:26 FAILED

This test (577479575174) was completed on the 01 September 2015 14:57:26 and FAILED the requirements for a valid MOT with 10 comments.

This test (577479575174) was completed on the 01 September 2015 14:57:26 and FAILED the requirements for a valid MOT with 10 comments.

Recorded mileage: 12,433

Recorded mileage: 12,433


ADVISORY

FAIL


MOT TEST: 27 August 2014 12:55:19 PASSED
MOT TEST: 27 August 2014 12:55:19 PASSED

This test (579499734250) was completed on the 27 August 2014 12:55:19 and PASSED the requirements for a valid MOT with 1 comments.

This test (579499734250) was completed on the 27 August 2014 12:55:19 and PASSED the requirements for a valid MOT with 1 comments.

Recorded mileage: 12,426

Recorded mileage: 12,426


ADVISORY


MOT TEST: 27 August 2014 12:55:19 FAILED
MOT TEST: 27 August 2014 12:55:19 FAILED

This test (689699034271) was completed on the 27 August 2014 12:55:19 and FAILED the requirements for a valid MOT with 2 comments.

This test (689699034271) was completed on the 27 August 2014 12:55:19 and FAILED the requirements for a valid MOT with 2 comments.

Recorded mileage: 12,426

Recorded mileage: 12,426


ADVISORY

PASS WITH RECTIFICATION


MOT TEST: 31 July 2013 09:09:25 PASSED
MOT TEST: 31 July 2013 09:09:25 PASSED

This test (328482713415) was completed on the 31 July 2013 09:09:25 and PASSED the requirements for a valid MOT with 4 comments.

This test (328482713415) was completed on the 31 July 2013 09:09:25 and PASSED the requirements for a valid MOT with 4 comments.

Recorded mileage: 12,374

Recorded mileage: 12,374


USER ENTERED


MOT TEST: 30 July 2013 12:02:57 FAILED
MOT TEST: 30 July 2013 12:02:57 FAILED

This test (649581313233) was completed on the 30 July 2013 12:02:57 and FAILED the requirements for a valid MOT with 5 comments.

This test (649581313233) was completed on the 30 July 2013 12:02:57 and FAILED the requirements for a valid MOT with 5 comments.

Recorded mileage: 0

Recorded mileage: 0


FAIL

USER ENTERED


MOT TEST: 13 October 2011 16:55:39 PASSED
MOT TEST: 13 October 2011 16:55:39 PASSED

This test (179386881287) was completed on the 13 October 2011 16:55:39 and PASSED the requirements for a valid MOT with 0 comments.

This test (179386881287) was completed on the 13 October 2011 16:55:39 and PASSED the requirements for a valid MOT with 0 comments.

Recorded mileage: 12,327

Recorded mileage: 12,327


MOT TEST: 04 January 2008 16:23:39 PASSED
MOT TEST: 04 January 2008 16:23:39 PASSED

This test (154084108054) was completed on the 04 January 2008 16:23:39 and PASSED the requirements for a valid MOT with 0 comments.

This test (154084108054) was completed on the 04 January 2008 16:23:39 and PASSED the requirements for a valid MOT with 0 comments.

Recorded mileage: 12,308

Recorded mileage: 12,308


MOT TEST: 04 January 2008 10:36:29 FAILED
MOT TEST: 04 January 2008 10:36:29 FAILED

This test (112004808453) was completed on the 04 January 2008 10:36:29 and FAILED the requirements for a valid MOT with 3 comments.

This test (112004808453) was completed on the 04 January 2008 10:36:29 and FAILED the requirements for a valid MOT with 3 comments.

Recorded mileage: 12,308

Recorded mileage: 12,308


FAIL


MOT TEST: 18 December 2006 16:35:31 PASSED
MOT TEST: 18 December 2006 16:35:31 PASSED

This test (614862556328) was completed on the 18 December 2006 16:35:31 and PASSED the requirements for a valid MOT with 0 comments.

This test (614862556328) was completed on the 18 December 2006 16:35:31 and PASSED the requirements for a valid MOT with 0 comments.

Recorded mileage: 12,287

Recorded mileage: 12,287


MOT TEST: 21 December 2005 14:52:55 PASSED
MOT TEST: 21 December 2005 14:52:55 PASSED

This test (960065455316) was completed on the 21 December 2005 14:52:55 and PASSED the requirements for a valid MOT with 0 comments.

This test (960065455316) was completed on the 21 December 2005 14:52:55 and PASSED the requirements for a valid MOT with 0 comments.

Recorded mileage: 12,271

Recorded mileage: 12,271