JYD 836K


JYD836K is registered to a Green 1972, Austin 6 cwt van with a Petrol engine. It Failed its most recent MOT Test on the 29 September 2016

10 unique faults (10 Total) reported in its MOT History (10 Tests).

0 common/recurring faults.

90% (9) MOT Pass Rate and a 10% (1) MOT Failure Rate.

47,448 recorded miles.

JYD 836K


JYD836K is registered to a Green 1972, Austin 6 cwt van with a Petrol engine. It Failed its most recent MOT Test on the 29 September 2016

10 unique faults (10 Total) reported in its MOT History (10 Tests).

0 common/recurring faults.

90% (9) MOT Pass Rate and a 10% (1) MOT Failure Rate.

47,448 recorded miles.

MOT PASS/Failure rate for JYD 836K

all MOT test results for JYD 836K represented as a percentage
MOT PASS/Failure rate for JYD 836K
all MOT test results for JYD 836K represented as a percentage

PERCENTAGE OF VEHICLE FAULTS WITH JYD 836K

ALL REPORTED FAULTS, DISPLAYED BY PERCENTAGE OF OCCURRENCE DURING ALL MOT TESTS
PERCENTAGE OF VEHICLE FAULTS WITH JYD 836K
ALL REPORTED FAULTS, DISPLAYED BY PERCENTAGE OF OCCURRENCE DURING ALL MOT TESTS
ADVISORY

FAIL

USER ENTERED

JYD 836K annual Faults by type

ALL REPORTED FAULTS, DISPLAYED over time and categorised by type
JYD 836K annual Faults by type
ALL REPORTED FAULTS, DISPLAYED over time and categorised by type

ALL JYD 836K ADVISORIES [4]

ALL ADVISORIES, ORDERED by OCCURRENCE DURING JYD 836K's MOT HISTORY
ALL JYD 836K ADVISORIES [4]
ALL ADVISORIES, ORDERED by OCCURRENCE DURING JYD 836K's MOT HISTORY
Advisory Faults | source www.vehiclestats.co.uk
Fault Fault Test Date Test Date/Time Reference MOT Test Reference
1 Rear service brake: service brake efficiency only just met. It would appear that the braking system requires adjustment or repair. (3.7.b.7) Rear service brake: service brake efficiency only just met. It would appear that the braking system requires adjustment or repair. (3.7.b.7) 25 July 2012 [11:10] 25/07/2012 219517402234 219517402234
1 Offside front brake hose slightly damaged (3.6.b.4d) Offside front brake hose slightly damaged (3.6.b.4d) 06 July 2007 [11:52] 06/07/2007 360027587121 360027587121
1 Offside track rod end ball joint has slight play (2.2.b.1f) Offside track rod end ball joint has slight play (2.2.b.1f) 06 July 2007 [11:52] 06/07/2007 360027587121 360027587121
1 Offside front suspension has slight play in a upper suspension ball joint (2.5.b.1a) Offside front suspension has slight play in a upper suspension ball joint (2.5.b.1a) 06 July 2007 [11:52] 06/07/2007 360027587121 360027587121

ALL JYD 836K Failure Faults [5]

ALL Failure faults, ORDERED by OCCURRENCE DURING JYD 836K's MOT HISTORY
ALL JYD 836K Failure Faults [5]
ALL Failure faults, ORDERED by OCCURRENCE DURING JYD 836K's MOT HISTORY
Fail Faults | source www.vehiclestats.co.uk
Fault Fault Test Date Test Date/Time Reference MOT Test Reference
1 Offside suspension component mounting prescribed area is inadequately repaired (2.4.a.3) Offside suspension component mounting prescribed area is inadequately repaired (2.4.a.3) 06 July 2007 [11:52] 06/07/2007 360027587121 360027587121
1 Seat belt anchorage prescribed area is inadequately repaired (5.2.6) Seat belt anchorage prescribed area is inadequately repaired (5.2.6) 06 July 2007 [11:52] 06/07/2007 360027587121 360027587121
1 Offside tie bar/rod locating pin retaining device missing (2.4.g.3b) Offside tie bar/rod locating pin retaining device missing (2.4.g.3b) 06 July 2007 [11:52] 06/07/2007 360027587121 360027587121
1 Offside front brake hose has insufficient room to move, resulting in fouling on any part (3.6.b.4a) Offside front brake hose has insufficient room to move, resulting in fouling on any part (3.6.b.4a) 06 July 2007 [11:52] 06/07/2007 360027587121 360027587121
1 Fuel cap/sealing device sealing washer missing (7.2.4c) Fuel cap/sealing device sealing washer missing (7.2.4c) 06 July 2007 [11:52] 06/07/2007 360027587121 360027587121

ALL JYD 836K User Entered Faults [1]

ALL User Entered faults, ORDERED by OCCURRENCE DURING JYD 836K's MOT HISTORY
ALL JYD 836K User Entered Faults [1]
ALL User Entered faults, ORDERED by OCCURRENCE DURING JYD 836K's MOT HISTORY
Advisory Faults | source www.vehiclestats.co.uk
Fault Fault Test Date Test Date/Time Reference MOT Test Reference
1 Footbrake has slight travel Footbrake has slight travel 25 July 2012 [11:10] 25/07/2012 219517402234 219517402234

MOT TEST: 29 September 2016 10:28:28 PASSED
MOT TEST: 29 September 2016 10:28:28 PASSED

This test (678336540095) was completed on the 29 September 2016 10:28:28 and PASSED the requirements for a valid MOT with 0 comments.

This test (678336540095) was completed on the 29 September 2016 10:28:28 and PASSED the requirements for a valid MOT with 0 comments.

Recorded mileage: 47,448

Recorded mileage: 47,448


MOT TEST: 11 September 2015 10:59:08 PASSED
MOT TEST: 11 September 2015 10:59:08 PASSED

This test (913393028448) was completed on the 11 September 2015 10:59:08 and PASSED the requirements for a valid MOT with 0 comments.

This test (913393028448) was completed on the 11 September 2015 10:59:08 and PASSED the requirements for a valid MOT with 0 comments.

Recorded mileage: 47,419

Recorded mileage: 47,419


MOT TEST: 19 August 2014 11:19:03 PASSED
MOT TEST: 19 August 2014 11:19:03 PASSED

This test (338981134271) was completed on the 19 August 2014 11:19:03 and PASSED the requirements for a valid MOT with 0 comments.

This test (338981134271) was completed on the 19 August 2014 11:19:03 and PASSED the requirements for a valid MOT with 0 comments.

Recorded mileage: 47,396

Recorded mileage: 47,396


MOT TEST: 06 August 2013 11:39:04 PASSED
MOT TEST: 06 August 2013 11:39:04 PASSED

This test (687808513260) was completed on the 06 August 2013 11:39:04 and PASSED the requirements for a valid MOT with 0 comments.

This test (687808513260) was completed on the 06 August 2013 11:39:04 and PASSED the requirements for a valid MOT with 0 comments.

Recorded mileage: 47,377

Recorded mileage: 47,377


MOT TEST: 25 July 2012 11:10:03 PASSED
MOT TEST: 25 July 2012 11:10:03 PASSED

This test (219517402234) was completed on the 25 July 2012 11:10:03 and PASSED the requirements for a valid MOT with 2 comments.

This test (219517402234) was completed on the 25 July 2012 11:10:03 and PASSED the requirements for a valid MOT with 2 comments.

Recorded mileage: 47,346

Recorded mileage: 47,346


ADVISORY

USER ENTERED


MOT TEST: 28 July 2011 11:06:36 PASSED
MOT TEST: 28 July 2011 11:06:36 PASSED

This test (326009101411) was completed on the 28 July 2011 11:06:36 and PASSED the requirements for a valid MOT with 0 comments.

This test (326009101411) was completed on the 28 July 2011 11:06:36 and PASSED the requirements for a valid MOT with 0 comments.

Recorded mileage: 47,269

Recorded mileage: 47,269


MOT TEST: 30 June 2010 11:45:32 PASSED
MOT TEST: 30 June 2010 11:45:32 PASSED

This test (612761380194) was completed on the 30 June 2010 11:45:32 and PASSED the requirements for a valid MOT with 0 comments.

This test (612761380194) was completed on the 30 June 2010 11:45:32 and PASSED the requirements for a valid MOT with 0 comments.

Recorded mileage: 47,232

Recorded mileage: 47,232


MOT TEST: 30 June 2009 12:06:40 PASSED
MOT TEST: 30 June 2009 12:06:40 PASSED

This test (751711689113) was completed on the 30 June 2009 12:06:40 and PASSED the requirements for a valid MOT with 0 comments.

This test (751711689113) was completed on the 30 June 2009 12:06:40 and PASSED the requirements for a valid MOT with 0 comments.

Recorded mileage: 47,163

Recorded mileage: 47,163


MOT TEST: 06 July 2007 15:30:40 PASSED
MOT TEST: 06 July 2007 15:30:40 PASSED

This test (510617787136) was completed on the 06 July 2007 15:30:40 and PASSED the requirements for a valid MOT with 0 comments.

This test (510617787136) was completed on the 06 July 2007 15:30:40 and PASSED the requirements for a valid MOT with 0 comments.

Recorded mileage: 47,075

Recorded mileage: 47,075


MOT TEST: 06 July 2007 11:52:37 FAILED
MOT TEST: 06 July 2007 11:52:37 FAILED

This test (360027587121) was completed on the 06 July 2007 11:52:37 and FAILED the requirements for a valid MOT with 8 comments.

This test (360027587121) was completed on the 06 July 2007 11:52:37 and FAILED the requirements for a valid MOT with 8 comments.

Recorded mileage: 47,073

Recorded mileage: 47,073


ADVISORY

FAIL