JYE 322D


JYE322D is registered to a Green 1966, Morris Minor 1000 with a Petrol engine. It Failed its most recent MOT Test on the 08 August 2016

20 unique faults (23 Total) reported in its MOT History (18 Tests).

3 common/recurring faults, the most frequent (2 times) is: Offside Front wheel bearing has slight play (2.5.A.3c).

61% (11) MOT Pass Rate and a 39% (7) MOT Failure Rate.

81,257 recorded miles.

JYE 322D


JYE322D is registered to a Green 1966, Morris Minor 1000 with a Petrol engine. It Failed its most recent MOT Test on the 08 August 2016

20 unique faults (23 Total) reported in its MOT History (18 Tests).

3 common/recurring faults, the most frequent (2 times) is: Offside Front wheel bearing has slight play (2.5.A.3c).

61% (11) MOT Pass Rate and a 39% (7) MOT Failure Rate.

81,257 recorded miles.

MOT PASS/Failure rate for JYE 322D

all MOT test results for JYE 322D represented as a percentage
MOT PASS/Failure rate for JYE 322D
all MOT test results for JYE 322D represented as a percentage

PERCENTAGE OF VEHICLE FAULTS WITH JYE 322D

ALL REPORTED FAULTS, DISPLAYED BY PERCENTAGE OF OCCURRENCE DURING ALL MOT TESTS
PERCENTAGE OF VEHICLE FAULTS WITH JYE 322D
ALL REPORTED FAULTS, DISPLAYED BY PERCENTAGE OF OCCURRENCE DURING ALL MOT TESTS
ADVISORY

FAIL

USER ENTERED

PASS WITH RECTIFICATION

JYE 322D annual Faults by type

ALL REPORTED FAULTS, DISPLAYED over time and categorised by type
JYE 322D annual Faults by type
ALL REPORTED FAULTS, DISPLAYED over time and categorised by type

RECURRING FAULTS WITH JYE 322D

FAULTS THAT HAVE OCCURED MORE THAN ONCE DURING JYE 322D's MOT HISTORY
RECURRING FAULTS WITH JYE 322D
FAULTS THAT HAVE OCCURED MORE THAN ONCE DURING JYE 322D's MOT HISTORY
Fault Fault Test Date Test Date/Time Reference MOT Test Reference
2 Offside front wheel bearing has slight play (2.5.a.3c) Offside front wheel bearing has slight play (2.5.a.3c) 06 June 2008 [11:50] 06/06/2008 04 June 2008 [16:15] 04/06/2008 352558358110 352558358110 713346158127 713346158127
2 Slight oil leak from rear differential Slight oil leak from rear differential 06 June 2008 [11:50] 06/06/2008 04 June 2008 [16:15] 04/06/2008 352558358110 352558358110 713346158127 713346158127
2 Oil leak Oil leak 25 May 2007 [10:21] 25/05/2007 25 May 2007 [10:21] 25/05/2007 953125447116 953125447116 354165547130 354165547130

ALL JYE 322D ADVISORIES [2]

ALL ADVISORIES, ORDERED by OCCURRENCE DURING JYE 322D's MOT HISTORY
ALL JYE 322D ADVISORIES [2]
ALL ADVISORIES, ORDERED by OCCURRENCE DURING JYE 322D's MOT HISTORY
Advisory Faults | source www.vehiclestats.co.uk
Fault Fault Test Date Test Date/Time Reference MOT Test Reference
2 Offside front wheel bearing has slight play (2.5.a.3c) Offside front wheel bearing has slight play (2.5.a.3c) 06 June 2008 [11:50] 06/06/2008 04 June 2008 [16:15] 04/06/2008 352558358110 352558358110 713346158127 713346158127

ALL JYE 322D Failure Faults [16]

ALL Failure faults, ORDERED by OCCURRENCE DURING JYE 322D's MOT HISTORY
ALL JYE 322D Failure Faults [16]
ALL Failure faults, ORDERED by OCCURRENCE DURING JYE 322D's MOT HISTORY
Fail Faults | source www.vehiclestats.co.uk
Fault Fault Test Date Test Date/Time Reference MOT Test Reference
1 Brake pedal excessively corroded (3.3.a.1a) Brake pedal excessively corroded (3.3.a.1a) 23 May 2016 [14:35] 23/05/2016 481703652192 481703652192
1 Offside upper front suspension ball joint dust cover excessively damaged so that it no longer prevents the ingress of dirt (2.4.g.2) Offside upper front suspension ball joint dust cover excessively damaged so that it no longer prevents the ingress of dirt (2.4.g.2) 14 May 2015 [16:15] 14/05/2015 516684635165 516684635165
1 Nearside rear suspension component mounting prescribed area is fractured (2.4.a.3) Nearside rear suspension component mounting prescribed area is fractured (2.4.a.3) 14 May 2015 [16:15] 14/05/2015 516684635165 516684635165
1 Offside rear suspension component mounting prescribed area is excessively corroded (2.4.a.3) Offside rear suspension component mounting prescribed area is excessively corroded (2.4.a.3) 20 May 2014 [16:49] 20/05/2014 529040044134 529040044134
1 Offside front body or chassis has excessive corrosion, seriously affecting its strength within 30cm of the body mountings (6.1.b.2) Offside front body or chassis has excessive corrosion, seriously affecting its strength within 30cm of the body mountings (6.1.b.2) 20 May 2014 [16:49] 20/05/2014 529040044134 529040044134
1 Centre registration plate lamp not working (1.1.c.1d) Centre registration plate lamp not working (1.1.c.1d) 24 May 2011 [15:20] 24/05/2011 378704041129 378704041129
1 Nearside front suspension component mounting prescribed area is excessively corroded (2.4.a.3) Nearside front suspension component mounting prescribed area is excessively corroded (2.4.a.3) 24 May 2011 [15:20] 24/05/2011 378704041129 378704041129
1 Offside front suspension component mounting prescribed area is excessively corroded (2.4.a.3) Offside front suspension component mounting prescribed area is excessively corroded (2.4.a.3) 24 May 2011 [15:20] 24/05/2011 378704041129 378704041129
1 Brake hydraulic reservoir leaking hydraulic fluid (3.6.a.1) Brake hydraulic reservoir leaking hydraulic fluid (3.6.a.1) 06 May 2009 [09:20] 06/05/2009 323206129183 323206129183
1 Offside rear passenger seat cannot be secured in the upright position. (6.2.3) Offside rear passenger seat cannot be secured in the upright position. (6.2.3) 04 June 2008 [16:15] 04/06/2008 713346158127 713346158127
1 Nearside windscreen washer provides insufficient washer liquid (8.2.3) Nearside windscreen washer provides insufficient washer liquid (8.2.3) 04 June 2008 [16:15] 04/06/2008 713346158127 713346158127
1 Nearside headlamp aim too low (1.8) Nearside headlamp aim too low (1.8) 04 June 2008 [16:15] 04/06/2008 713346158127 713346158127
1 Offside headlamp aim too low (1.8) Offside headlamp aim too low (1.8) 04 June 2008 [16:15] 04/06/2008 713346158127 713346158127
1 Nearside front suspension retaining device ineffective (2.5.a.4) Nearside front suspension retaining device ineffective (2.5.a.4) 04 June 2008 [16:15] 04/06/2008 713346158127 713346158127
1 Offside rear parking brake recording little or no effort (3.7.b.6a) Offside rear parking brake recording little or no effort (3.7.b.6a) 04 June 2008 [16:15] 04/06/2008 713346158127 713346158127
1 Parking brake: efficiency below requirements (3.7.b.7) Parking brake: efficiency below requirements (3.7.b.7) 04 June 2008 [16:15] 04/06/2008 713346158127 713346158127

ALL JYE 322D User Entered Faults [4]

ALL User Entered faults, ORDERED by OCCURRENCE DURING JYE 322D's MOT HISTORY
ALL JYE 322D User Entered Faults [4]
ALL User Entered faults, ORDERED by OCCURRENCE DURING JYE 322D's MOT HISTORY
Advisory Faults | source www.vehiclestats.co.uk
Fault Fault Test Date Test Date/Time Reference MOT Test Reference
2 Slight oil leak from rear differential Slight oil leak from rear differential 06 June 2008 [11:50] 06/06/2008 04 June 2008 [16:15] 04/06/2008 352558358110 352558358110 713346158127 713346158127
2 Oil leak Oil leak 25 May 2007 [10:21] 25/05/2007 25 May 2007 [10:21] 25/05/2007 953125447116 953125447116 354165547130 354165547130

ALL JYE 322D Pass With Rectification Faults [1]

ALL Pass With Rectification faults, ORDERED by OCCURRENCE DURING JYE 322D's MOT HISTORY
ALL JYE 322D Pass With Rectification Faults [1]
ALL Pass With Rectification faults, ORDERED by OCCURRENCE DURING JYE 322D's MOT HISTORY
Pass With Rectification Faults | source www.vehiclestats.co.uk
Fault Fault Test Date Test Date/Time Reference MOT Test Reference
1 Nearside rear position lamp(s) excessively deteriorated so that it is not visible from a reasonable distance (1.1.a.3d) Nearside rear position lamp(s) excessively deteriorated so that it is not visible from a reasonable distance (1.1.a.3d) 25 May 2007 [10:21] 25/05/2007 354165547130 354165547130

MOT TEST: 08 August 2016 15:44:11 PASSED
MOT TEST: 08 August 2016 15:44:11 PASSED

This test (401908783932) was completed on the 08 August 2016 15:44:11 and PASSED the requirements for a valid MOT with 0 comments.

This test (401908783932) was completed on the 08 August 2016 15:44:11 and PASSED the requirements for a valid MOT with 0 comments.

Recorded mileage: 9,514

Recorded mileage: 9,514


MOT TEST: 23 May 2016 14:35:06 FAILED
MOT TEST: 23 May 2016 14:35:06 FAILED

This test (481703652192) was completed on the 23 May 2016 14:35:06 and FAILED the requirements for a valid MOT with 1 comments.

This test (481703652192) was completed on the 23 May 2016 14:35:06 and FAILED the requirements for a valid MOT with 1 comments.

Recorded mileage: 9,508

Recorded mileage: 9,508


FAIL


MOT TEST: 15 May 2015 13:14:09 PASSED
MOT TEST: 15 May 2015 13:14:09 PASSED

This test (319015335132) was completed on the 15 May 2015 13:14:09 and PASSED the requirements for a valid MOT with 0 comments.

This test (319015335132) was completed on the 15 May 2015 13:14:09 and PASSED the requirements for a valid MOT with 0 comments.

Recorded mileage: 9,181

Recorded mileage: 9,181


MOT TEST: 14 May 2015 16:15:41 FAILED
MOT TEST: 14 May 2015 16:15:41 FAILED

This test (516684635165) was completed on the 14 May 2015 16:15:41 and FAILED the requirements for a valid MOT with 2 comments.

This test (516684635165) was completed on the 14 May 2015 16:15:41 and FAILED the requirements for a valid MOT with 2 comments.

Recorded mileage: 9,181

Recorded mileage: 9,181


FAIL


MOT TEST: 06 June 2014 12:02:26 PASSED
MOT TEST: 06 June 2014 12:02:26 PASSED

This test (219447454411) was completed on the 06 June 2014 12:02:26 and PASSED the requirements for a valid MOT with 0 comments.

This test (219447454411) was completed on the 06 June 2014 12:02:26 and PASSED the requirements for a valid MOT with 0 comments.

Recorded mileage: 8,691

Recorded mileage: 8,691


MOT TEST: 20 May 2014 16:49:07 FAILED
MOT TEST: 20 May 2014 16:49:07 FAILED

This test (529040044134) was completed on the 20 May 2014 16:49:07 and FAILED the requirements for a valid MOT with 2 comments.

This test (529040044134) was completed on the 20 May 2014 16:49:07 and FAILED the requirements for a valid MOT with 2 comments.

Recorded mileage: 8,686

Recorded mileage: 8,686


FAIL


MOT TEST: 21 May 2013 16:33:19 PASSED
MOT TEST: 21 May 2013 16:33:19 PASSED

This test (977831443152) was completed on the 21 May 2013 16:33:19 and PASSED the requirements for a valid MOT with 0 comments.

This test (977831443152) was completed on the 21 May 2013 16:33:19 and PASSED the requirements for a valid MOT with 0 comments.

Recorded mileage: 8,501

Recorded mileage: 8,501


MOT TEST: 22 May 2012 09:21:39 PASSED
MOT TEST: 22 May 2012 09:21:39 PASSED

This test (977593542173) was completed on the 22 May 2012 09:21:39 and PASSED the requirements for a valid MOT with 0 comments.

This test (977593542173) was completed on the 22 May 2012 09:21:39 and PASSED the requirements for a valid MOT with 0 comments.

Recorded mileage: 8,258

Recorded mileage: 8,258


MOT TEST: 06 June 2011 12:29:27 PASSED
MOT TEST: 06 June 2011 12:29:27 PASSED

This test (138067151167) was completed on the 06 June 2011 12:29:27 and PASSED the requirements for a valid MOT with 0 comments.

This test (138067151167) was completed on the 06 June 2011 12:29:27 and PASSED the requirements for a valid MOT with 0 comments.

Recorded mileage: 8,233

Recorded mileage: 8,233


MOT TEST: 24 May 2011 15:20:29 FAILED
MOT TEST: 24 May 2011 15:20:29 FAILED

This test (378704041129) was completed on the 24 May 2011 15:20:29 and FAILED the requirements for a valid MOT with 3 comments.

This test (378704041129) was completed on the 24 May 2011 15:20:29 and FAILED the requirements for a valid MOT with 3 comments.

Recorded mileage: 8,230

Recorded mileage: 8,230


FAIL


MOT TEST: 11 May 2010 07:59:20 PASSED
MOT TEST: 11 May 2010 07:59:20 PASSED

This test (821081930136) was completed on the 11 May 2010 07:59:20 and PASSED the requirements for a valid MOT with 0 comments.

This test (821081930136) was completed on the 11 May 2010 07:59:20 and PASSED the requirements for a valid MOT with 0 comments.

Recorded mileage: 8,212

Recorded mileage: 8,212


MOT TEST: 06 May 2009 13:33:45 PASSED
MOT TEST: 06 May 2009 13:33:45 PASSED

This test (203336129461) was completed on the 06 May 2009 13:33:45 and PASSED the requirements for a valid MOT with 0 comments.

This test (203336129461) was completed on the 06 May 2009 13:33:45 and PASSED the requirements for a valid MOT with 0 comments.

Recorded mileage: 81,257

Recorded mileage: 81,257


MOT TEST: 06 May 2009 09:20:55 FAILED
MOT TEST: 06 May 2009 09:20:55 FAILED

This test (323206129183) was completed on the 06 May 2009 09:20:55 and FAILED the requirements for a valid MOT with 1 comments.

This test (323206129183) was completed on the 06 May 2009 09:20:55 and FAILED the requirements for a valid MOT with 1 comments.

Recorded mileage: 81,257

Recorded mileage: 81,257


FAIL


MOT TEST: 06 June 2008 11:50:38 PASSED
MOT TEST: 06 June 2008 11:50:38 PASSED

This test (352558358110) was completed on the 06 June 2008 11:50:38 and PASSED the requirements for a valid MOT with 2 comments.

This test (352558358110) was completed on the 06 June 2008 11:50:38 and PASSED the requirements for a valid MOT with 2 comments.

Recorded mileage: 6,750

Recorded mileage: 6,750


ADVISORY

USER ENTERED


MOT TEST: 04 June 2008 16:15:32 FAILED
MOT TEST: 04 June 2008 16:15:32 FAILED

This test (713346158127) was completed on the 04 June 2008 16:15:32 and FAILED the requirements for a valid MOT with 9 comments.

This test (713346158127) was completed on the 04 June 2008 16:15:32 and FAILED the requirements for a valid MOT with 9 comments.

Recorded mileage: 6,723

Recorded mileage: 6,723


ADVISORY

FAIL

USER ENTERED


MOT TEST: 25 May 2007 10:21:18 PASSED
MOT TEST: 25 May 2007 10:21:18 PASSED

This test (953125447116) was completed on the 25 May 2007 10:21:18 and PASSED the requirements for a valid MOT with 1 comments.

This test (953125447116) was completed on the 25 May 2007 10:21:18 and PASSED the requirements for a valid MOT with 1 comments.

Recorded mileage: 3,768

Recorded mileage: 3,768


USER ENTERED


MOT TEST: 25 May 2007 10:21:18 FAILED
MOT TEST: 25 May 2007 10:21:18 FAILED

This test (354165547130) was completed on the 25 May 2007 10:21:18 and FAILED the requirements for a valid MOT with 2 comments.

This test (354165547130) was completed on the 25 May 2007 10:21:18 and FAILED the requirements for a valid MOT with 2 comments.

Recorded mileage: 3,768

Recorded mileage: 3,768


USER ENTERED

PASS WITH RECTIFICATION


MOT TEST: 01 June 2006 15:04:30 PASSED
MOT TEST: 01 June 2006 15:04:30 PASSED

This test (162792656147) was completed on the 01 June 2006 15:04:30 and PASSED the requirements for a valid MOT with 0 comments.

This test (162792656147) was completed on the 01 June 2006 15:04:30 and PASSED the requirements for a valid MOT with 0 comments.

Recorded mileage: 3,532

Recorded mileage: 3,532