JYE 784D


JYE784D is registered to a Green 1966, Morris Minor 1000 with a Petrol engine. It Failed its most recent MOT Test on the 04 August 2016

16 unique faults (16 Total) reported in its MOT History (3 Tests).

0 common/recurring faults.

67% (2) MOT Pass Rate and a 33% (1) MOT Failure Rate.

23,979 recorded miles.

JYE 784D


JYE784D is registered to a Green 1966, Morris Minor 1000 with a Petrol engine. It Failed its most recent MOT Test on the 04 August 2016

16 unique faults (16 Total) reported in its MOT History (3 Tests).

0 common/recurring faults.

67% (2) MOT Pass Rate and a 33% (1) MOT Failure Rate.

23,979 recorded miles.

MOT PASS/Failure rate for JYE 784D

all MOT test results for JYE 784D represented as a percentage
MOT PASS/Failure rate for JYE 784D
all MOT test results for JYE 784D represented as a percentage

PERCENTAGE OF VEHICLE FAULTS WITH JYE 784D

ALL REPORTED FAULTS, DISPLAYED BY PERCENTAGE OF OCCURRENCE DURING ALL MOT TESTS
PERCENTAGE OF VEHICLE FAULTS WITH JYE 784D
ALL REPORTED FAULTS, DISPLAYED BY PERCENTAGE OF OCCURRENCE DURING ALL MOT TESTS
ADVISORY

FAIL

JYE 784D annual Faults by type

ALL REPORTED FAULTS, DISPLAYED over time and categorised by type
JYE 784D annual Faults by type
ALL REPORTED FAULTS, DISPLAYED over time and categorised by type

ALL JYE 784D ADVISORIES [6]

ALL ADVISORIES, ORDERED by OCCURRENCE DURING JYE 784D's MOT HISTORY
ALL JYE 784D ADVISORIES [6]
ALL ADVISORIES, ORDERED by OCCURRENCE DURING JYE 784D's MOT HISTORY
Fail Faults | source www.vehiclestats.co.uk
Fault Fault Test Date Test Date/Time Reference MOT Test Reference
1 Offside front tyre age cracking Offside front tyre age cracking 01 August 2016 [08:20] 01/08/2016 746800266209 746800266209
1 Nearside rear tyre age cracking Nearside rear tyre age cracking 01 August 2016 [08:20] 01/08/2016 746800266209 746800266209
1 Offside rear tyre age cracking Offside rear tyre age cracking 01 August 2016 [08:20] 01/08/2016 746800266209 746800266209
1 Nearside rear leaf spring has a slightly deteriorated shackle pin rubber bush not resulting in excessive movement (2.4.b.2) Nearside rear leaf spring has a slightly deteriorated shackle pin rubber bush not resulting in excessive movement (2.4.b.2) 02 April 2015 [13:45] 02/04/2015 808902095069 808902095069
1 Offside rear leaf spring has a slightly deteriorated shackle pin rubber bush not resulting in excessive movement (2.4.b.2) Offside rear leaf spring has a slightly deteriorated shackle pin rubber bush not resulting in excessive movement (2.4.b.2) 02 April 2015 [13:45] 02/04/2015 808902095069 808902095069
1 Offside front track rod end ball joint dust cover damaged, but preventing the ingress of dirt (2.2.c.1c) Offside front track rod end ball joint dust cover damaged, but preventing the ingress of dirt (2.2.c.1c) 02 April 2015 [13:45] 02/04/2015 808902095069 808902095069

ALL JYE 784D Failure Faults [10]

ALL Failure faults, ORDERED by OCCURRENCE DURING JYE 784D's MOT HISTORY
ALL JYE 784D Failure Faults [10]
ALL Failure faults, ORDERED by OCCURRENCE DURING JYE 784D's MOT HISTORY
Fail Faults | source www.vehiclestats.co.uk
Fault Fault Test Date Test Date/Time Reference MOT Test Reference
1 Stop lamp not working (1.2.1b) Stop lamp not working (1.2.1b) 01 August 2016 [08:20] 01/08/2016 746800266209 746800266209
1 Nearside front position lamp(s) not working (1.1.a.3b) Nearside front position lamp(s) not working (1.1.a.3b) 01 August 2016 [08:20] 01/08/2016 746800266209 746800266209
1 Offside front position lamp(s) not working (1.1.a.3b) Offside front position lamp(s) not working (1.1.a.3b) 01 August 2016 [08:20] 01/08/2016 746800266209 746800266209
1 Nearside rear position lamp(s) not working (1.1.a.3b) Nearside rear position lamp(s) not working (1.1.a.3b) 01 August 2016 [08:20] 01/08/2016 746800266209 746800266209
1 Offside rear position lamp(s) not working (1.1.a.3b) Offside rear position lamp(s) not working (1.1.a.3b) 01 August 2016 [08:20] 01/08/2016 746800266209 746800266209
1 Nearside headlamp not working on dipped beam (1.7.5a) Nearside headlamp not working on dipped beam (1.7.5a) 01 August 2016 [08:20] 01/08/2016 746800266209 746800266209
1 Nearside headlamp not working on main beam (1.7.5a) Nearside headlamp not working on main beam (1.7.5a) 01 August 2016 [08:20] 01/08/2016 746800266209 746800266209
1 Offside headlamp not working on dipped beam (1.7.5a) Offside headlamp not working on dipped beam (1.7.5a) 01 August 2016 [08:20] 01/08/2016 746800266209 746800266209
1 Offside headlamp not working on main beam (1.7.5a) Offside headlamp not working on main beam (1.7.5a) 01 August 2016 [08:20] 01/08/2016 746800266209 746800266209
1 Nearside front tyre has ply or cords exposed (4.1.d.1b) Nearside front tyre has ply or cords exposed (4.1.d.1b) 01 August 2016 [08:20] 01/08/2016 746800266209 746800266209

MOT TEST: 04 August 2016 16:18:28 PASSED
MOT TEST: 04 August 2016 16:18:28 PASSED

This test (392698717495) was completed on the 04 August 2016 16:18:28 and PASSED the requirements for a valid MOT with 0 comments.

This test (392698717495) was completed on the 04 August 2016 16:18:28 and PASSED the requirements for a valid MOT with 0 comments.

Recorded mileage: 23,979

Recorded mileage: 23,979


MOT TEST: 01 August 2016 08:20:39 FAILED
MOT TEST: 01 August 2016 08:20:39 FAILED

This test (746800266209) was completed on the 01 August 2016 08:20:39 and FAILED the requirements for a valid MOT with 13 comments.

This test (746800266209) was completed on the 01 August 2016 08:20:39 and FAILED the requirements for a valid MOT with 13 comments.

Recorded mileage: 23,979

Recorded mileage: 23,979


ADVISORY

FAIL


MOT TEST: 02 April 2015 13:45:26 PASSED
MOT TEST: 02 April 2015 13:45:26 PASSED

This test (808902095069) was completed on the 02 April 2015 13:45:26 and PASSED the requirements for a valid MOT with 3 comments.

This test (808902095069) was completed on the 02 April 2015 13:45:26 and PASSED the requirements for a valid MOT with 3 comments.

Recorded mileage: 23,950

Recorded mileage: 23,950


ADVISORY