JYF 528K


JYF528K is registered to a Grey 1971, Morris with a Petrol engine. It Failed its most recent MOT Test on the 26 January 2018

13 unique faults (19 Total) reported in its MOT History (12 Tests).

6 common/recurring faults, the most frequent (2 times) is: Steering column top bearing slightly worn (2.1.2c).

75% (9) MOT Pass Rate and a 25% (3) MOT Failure Rate.

95,117 recorded miles.

JYF 528K


JYF528K is registered to a Grey 1971, Morris with a Petrol engine. It Failed its most recent MOT Test on the 26 January 2018

13 unique faults (19 Total) reported in its MOT History (12 Tests).

6 common/recurring faults, the most frequent (2 times) is: Steering column top bearing slightly worn (2.1.2c).

75% (9) MOT Pass Rate and a 25% (3) MOT Failure Rate.

95,117 recorded miles.

MOT PASS/Failure rate for JYF 528K

all MOT test results for JYF 528K represented as a percentage
MOT PASS/Failure rate for JYF 528K
all MOT test results for JYF 528K represented as a percentage

PERCENTAGE OF VEHICLE FAULTS WITH JYF 528K

ALL REPORTED FAULTS, DISPLAYED BY PERCENTAGE OF OCCURRENCE DURING ALL MOT TESTS
PERCENTAGE OF VEHICLE FAULTS WITH JYF 528K
ALL REPORTED FAULTS, DISPLAYED BY PERCENTAGE OF OCCURRENCE DURING ALL MOT TESTS
ADVISORY

FAIL

USER ENTERED

PASS WITH RECTIFICATION

JYF 528K annual Faults by type

ALL REPORTED FAULTS, DISPLAYED over time and categorised by type
JYF 528K annual Faults by type
ALL REPORTED FAULTS, DISPLAYED over time and categorised by type

RECURRING FAULTS WITH JYF 528K

FAULTS THAT HAVE OCCURED MORE THAN ONCE DURING JYF 528K's MOT HISTORY
RECURRING FAULTS WITH JYF 528K
FAULTS THAT HAVE OCCURED MORE THAN ONCE DURING JYF 528K's MOT HISTORY
Fault Fault Test Date Test Date/Time Reference MOT Test Reference
2 Steering column top bearing slightly worn (2.1.2c) Steering column top bearing slightly worn (2.1.2c) 26 January 2018 [09:31] 26/01/2018 22 January 2018 [10:28] 22/01/2018 327174859479 327174859479 194898178724 194898178724
2 Offside front wheel bearing has slight play (2.5.a.3c) Offside front wheel bearing has slight play (2.5.a.3c) 26 January 2018 [09:31] 26/01/2018 22 January 2018 [10:28] 22/01/2018 327174859479 327174859479 194898178724 194898178724
2 N/s/r shock mounting repaired N/s/r shock mounting repaired 07 May 2011 [13:42] 07/05/2011 07 May 2011 [13:42] 07/05/2011 366607521116 366607521116 735747121144 735747121144
2 O/s/r shock mount O/s/r shock mount 07 May 2011 [13:42] 07/05/2011 07 May 2011 [13:42] 07/05/2011 366607521116 366607521116 735747121144 735747121144
2 Rear foot brake slightly uneven o/s 60 n/s 120 Rear foot brake slightly uneven o/s 60 n/s 120 07 May 2011 [13:42] 07/05/2011 07 May 2011 [13:42] 07/05/2011 366607521116 366607521116 735747121144 735747121144
2 Slight bind on n/s/r brake Slight bind on n/s/r brake 07 May 2011 [13:42] 07/05/2011 07 May 2011 [13:42] 07/05/2011 366607521116 366607521116 735747121144 735747121144

ALL JYF 528K ADVISORIES [5]

ALL ADVISORIES, ORDERED by OCCURRENCE DURING JYF 528K's MOT HISTORY
ALL JYF 528K ADVISORIES [5]
ALL ADVISORIES, ORDERED by OCCURRENCE DURING JYF 528K's MOT HISTORY
Advisory Faults | source www.vehiclestats.co.uk
Fault Fault Test Date Test Date/Time Reference MOT Test Reference
2 Steering column top bearing slightly worn (2.1.2c) Steering column top bearing slightly worn (2.1.2c) 26 January 2018 [09:31] 26/01/2018 22 January 2018 [10:28] 22/01/2018 327174859479 327174859479 194898178724 194898178724
2 Offside front wheel bearing has slight play (2.5.a.3c) Offside front wheel bearing has slight play (2.5.a.3c) 26 January 2018 [09:31] 26/01/2018 22 January 2018 [10:28] 22/01/2018 327174859479 327174859479 194898178724 194898178724
1 Nearside front upper suspension arm rubber bush deteriorated but not resulting in excessive movement outer shock bush (2.4.g.2) Nearside front upper suspension arm rubber bush deteriorated but not resulting in excessive movement outer shock bush (2.4.g.2) 22 January 2018 [10:28] 22/01/2018 194898178724 194898178724

ALL JYF 528K Failure Faults [4]

ALL Failure faults, ORDERED by OCCURRENCE DURING JYF 528K's MOT HISTORY
ALL JYF 528K Failure Faults [4]
ALL Failure faults, ORDERED by OCCURRENCE DURING JYF 528K's MOT HISTORY
Advisory Faults | source www.vehiclestats.co.uk
Fault Fault Test Date Test Date/Time Reference MOT Test Reference
1 Offside front upper suspension arm rubber bush deteriorated resulting in excessive movement outer shock bush (2.4.g.2) Offside front upper suspension arm rubber bush deteriorated resulting in excessive movement outer shock bush (2.4.g.2) 22 January 2018 [10:28] 22/01/2018 194898178724 194898178724
1 Offside rear rear brake recording little or no effort hand brake (3.7.b.5a) Offside rear rear brake recording little or no effort hand brake (3.7.b.5a) 22 January 2018 [10:28] 22/01/2018 194898178724 194898178724
1 Nearside stop lamp not working (1.2.1b) Nearside stop lamp not working (1.2.1b) 30 April 2012 [09:21] 30/04/2012 896921522196 896921522196
1 Offside stop lamp not working (1.2.1b) Offside stop lamp not working (1.2.1b) 30 April 2012 [09:21] 30/04/2012 896921522196 896921522196

ALL JYF 528K User Entered Faults [8]

ALL User Entered faults, ORDERED by OCCURRENCE DURING JYF 528K's MOT HISTORY
ALL JYF 528K User Entered Faults [8]
ALL User Entered faults, ORDERED by OCCURRENCE DURING JYF 528K's MOT HISTORY
User Entered Faults | source www.vehiclestats.co.uk
Fault Fault Test Date Test Date/Time Reference MOT Test Reference
2 N/s/r shock mounting repaired N/s/r shock mounting repaired 07 May 2011 [13:42] 07/05/2011 07 May 2011 [13:42] 07/05/2011 366607521116 366607521116 735747121144 735747121144
2 O/s/r shock mount O/s/r shock mount 07 May 2011 [13:42] 07/05/2011 07 May 2011 [13:42] 07/05/2011 366607521116 366607521116 735747121144 735747121144
2 Rear foot brake slightly uneven o/s 60 n/s 120 Rear foot brake slightly uneven o/s 60 n/s 120 07 May 2011 [13:42] 07/05/2011 07 May 2011 [13:42] 07/05/2011 366607521116 366607521116 735747121144 735747121144
2 Slight bind on n/s/r brake Slight bind on n/s/r brake 07 May 2011 [13:42] 07/05/2011 07 May 2011 [13:42] 07/05/2011 366607521116 366607521116 735747121144 735747121144

ALL JYF 528K Pass With Rectification Faults [2]

ALL Pass With Rectification faults, ORDERED by OCCURRENCE DURING JYF 528K's MOT HISTORY
ALL JYF 528K Pass With Rectification Faults [2]
ALL Pass With Rectification faults, ORDERED by OCCURRENCE DURING JYF 528K's MOT HISTORY
Pass With Rectification Faults | source www.vehiclestats.co.uk
Fault Fault Test Date Test Date/Time Reference MOT Test Reference
1 Nearside front direction indicator incorrect colour (1.4.a.2f) Nearside front direction indicator incorrect colour (1.4.a.2f) 07 May 2011 [13:42] 07/05/2011 735747121144 735747121144
1 Offside front direction indicator incorrect colour (1.4.a.2f) Offside front direction indicator incorrect colour (1.4.a.2f) 07 May 2011 [13:42] 07/05/2011 735747121144 735747121144

MOT TEST: 26 January 2018 09:31:45 PASSED
MOT TEST: 26 January 2018 09:31:45 PASSED

This test (327174859479) was completed on the 26 January 2018 09:31:45 and PASSED the requirements for a valid MOT with 2 comments.

This test (327174859479) was completed on the 26 January 2018 09:31:45 and PASSED the requirements for a valid MOT with 2 comments.

Recorded mileage: 46,359

Recorded mileage: 46,359


ADVISORY


MOT TEST: 22 January 2018 10:28:18 FAILED
MOT TEST: 22 January 2018 10:28:18 FAILED

This test (194898178724) was completed on the 22 January 2018 10:28:18 and FAILED the requirements for a valid MOT with 5 comments.

This test (194898178724) was completed on the 22 January 2018 10:28:18 and FAILED the requirements for a valid MOT with 5 comments.

Recorded mileage: 46,339

Recorded mileage: 46,339


ADVISORY

FAIL


MOT TEST: 12 January 2017 09:11:54 PASSED
MOT TEST: 12 January 2017 09:11:54 PASSED

This test (628476500233) was completed on the 12 January 2017 09:11:54 and PASSED the requirements for a valid MOT with 0 comments.

This test (628476500233) was completed on the 12 January 2017 09:11:54 and PASSED the requirements for a valid MOT with 0 comments.

Recorded mileage: 43,262

Recorded mileage: 43,262


MOT TEST: 15 January 2016 09:05:33 PASSED
MOT TEST: 15 January 2016 09:05:33 PASSED

This test (884879686297) was completed on the 15 January 2016 09:05:33 and PASSED the requirements for a valid MOT with 0 comments.

This test (884879686297) was completed on the 15 January 2016 09:05:33 and PASSED the requirements for a valid MOT with 0 comments.

Recorded mileage: 41,143

Recorded mileage: 41,143


MOT TEST: 16 January 2015 09:10:27 PASSED
MOT TEST: 16 January 2015 09:10:27 PASSED

This test (687016715041) was completed on the 16 January 2015 09:10:27 and PASSED the requirements for a valid MOT with 0 comments.

This test (687016715041) was completed on the 16 January 2015 09:10:27 and PASSED the requirements for a valid MOT with 0 comments.

Recorded mileage: 40,043

Recorded mileage: 40,043


MOT TEST: 30 January 2014 10:57:36 PASSED
MOT TEST: 30 January 2014 10:57:36 PASSED

This test (298610534044) was completed on the 30 January 2014 10:57:36 and PASSED the requirements for a valid MOT with 0 comments.

This test (298610534044) was completed on the 30 January 2014 10:57:36 and PASSED the requirements for a valid MOT with 0 comments.

Recorded mileage: 38,834

Recorded mileage: 38,834


MOT TEST: 30 April 2012 11:10:54 PASSED
MOT TEST: 30 April 2012 11:10:54 PASSED

This test (857561522173) was completed on the 30 April 2012 11:10:54 and PASSED the requirements for a valid MOT with 0 comments.

This test (857561522173) was completed on the 30 April 2012 11:10:54 and PASSED the requirements for a valid MOT with 0 comments.

Recorded mileage: 37,918

Recorded mileage: 37,918


MOT TEST: 30 April 2012 09:21:44 FAILED
MOT TEST: 30 April 2012 09:21:44 FAILED

This test (896921522196) was completed on the 30 April 2012 09:21:44 and FAILED the requirements for a valid MOT with 2 comments.

This test (896921522196) was completed on the 30 April 2012 09:21:44 and FAILED the requirements for a valid MOT with 2 comments.

Recorded mileage: 37,917

Recorded mileage: 37,917


FAIL


MOT TEST: 07 May 2011 13:42:11 PASSED
MOT TEST: 07 May 2011 13:42:11 PASSED

This test (366607521116) was completed on the 07 May 2011 13:42:11 and PASSED the requirements for a valid MOT with 4 comments.

This test (366607521116) was completed on the 07 May 2011 13:42:11 and PASSED the requirements for a valid MOT with 4 comments.

Recorded mileage: 95,117

Recorded mileage: 95,117


USER ENTERED


MOT TEST: 07 May 2011 13:42:11 FAILED
MOT TEST: 07 May 2011 13:42:11 FAILED

This test (735747121144) was completed on the 07 May 2011 13:42:11 and FAILED the requirements for a valid MOT with 6 comments.

This test (735747121144) was completed on the 07 May 2011 13:42:11 and FAILED the requirements for a valid MOT with 6 comments.

Recorded mileage: 95,117

Recorded mileage: 95,117


USER ENTERED

PASS WITH RECTIFICATION


MOT TEST: 03 February 2009 12:46:03 PASSED
MOT TEST: 03 February 2009 12:46:03 PASSED

This test (101324539028) was completed on the 03 February 2009 12:46:03 and PASSED the requirements for a valid MOT with 0 comments.

This test (101324539028) was completed on the 03 February 2009 12:46:03 and PASSED the requirements for a valid MOT with 0 comments.

Recorded mileage: 94,070

Recorded mileage: 94,070


MOT TEST: 16 November 2007 11:57:55 PASSED
MOT TEST: 16 November 2007 11:57:55 PASSED

This test (622090127382) was completed on the 16 November 2007 11:57:55 and PASSED the requirements for a valid MOT with 0 comments.

This test (622090127382) was completed on the 16 November 2007 11:57:55 and PASSED the requirements for a valid MOT with 0 comments.

Recorded mileage: 93,655

Recorded mileage: 93,655