KAE 104B


KAE104B is registered to a Green 1964, Morris Minor 1000 with a Petrol engine. It Failed its most recent MOT Test on the 01 August 2017

26 unique faults (37 Total) reported in its MOT History (15 Tests).

10 common/recurring faults, the most frequent (3 times) is: Parking brake: efficiency below requirements (3.7.B.7).

53% (8) MOT Pass Rate and a 47% (7) MOT Failure Rate.

71,875 recorded miles.

KAE 104B


KAE104B is registered to a Green 1964, Morris Minor 1000 with a Petrol engine. It Failed its most recent MOT Test on the 01 August 2017

26 unique faults (37 Total) reported in its MOT History (15 Tests).

10 common/recurring faults, the most frequent (3 times) is: Parking brake: efficiency below requirements (3.7.B.7).

53% (8) MOT Pass Rate and a 47% (7) MOT Failure Rate.

71,875 recorded miles.

MOT PASS/Failure rate for KAE 104B

all MOT test results for KAE 104B represented as a percentage
MOT PASS/Failure rate for KAE 104B
all MOT test results for KAE 104B represented as a percentage

PERCENTAGE OF VEHICLE FAULTS WITH KAE 104B

ALL REPORTED FAULTS, DISPLAYED BY PERCENTAGE OF OCCURRENCE DURING ALL MOT TESTS
PERCENTAGE OF VEHICLE FAULTS WITH KAE 104B
ALL REPORTED FAULTS, DISPLAYED BY PERCENTAGE OF OCCURRENCE DURING ALL MOT TESTS
ADVISORY

FAIL

USER ENTERED

KAE 104B annual Faults by type

ALL REPORTED FAULTS, DISPLAYED over time and categorised by type
KAE 104B annual Faults by type
ALL REPORTED FAULTS, DISPLAYED over time and categorised by type

RECURRING FAULTS WITH KAE 104B

FAULTS THAT HAVE OCCURED MORE THAN ONCE DURING KAE 104B's MOT HISTORY
RECURRING FAULTS WITH KAE 104B
FAULTS THAT HAVE OCCURED MORE THAN ONCE DURING KAE 104B's MOT HISTORY
Fault Fault Test Date Test Date/Time Reference MOT Test Reference
3 Parking brake: efficiency below requirements (3.7.b.7) Parking brake: efficiency below requirements (3.7.b.7) 21 July 2016 [08:15] 21/07/2016 11 July 2014 [17:21] 11/07/2014 11 July 2013 [09:29] 11/07/2013 141474735628 141474735628 327532894162 327532894162 926302493132 926302493132
2 Brakes imbalanced across an axle (3.7.b.5b) Brakes imbalanced across an axle (3.7.b.5b) 21 July 2016 [08:15] 21/07/2016 18 June 2012 [10:23] 18/06/2012 141474735628 141474735628 285910072112 285910072112
2 Nearside headlamp aim too high (1.8) Nearside headlamp aim too high (1.8) 21 July 2016 [08:15] 21/07/2016 18 June 2012 [10:23] 18/06/2012 141474735628 141474735628 285910072112 285910072112
2 Nearside front suspension component mounting prescribed area is excessively corroded (2.4.a.3) Nearside front suspension component mounting prescribed area is excessively corroded (2.4.a.3) 03 July 2015 [12:58] 03/07/2015 11 July 2014 [17:21] 11/07/2014 138884885184 138884885184 327532894162 327532894162
2 Nearside rear suspension spring mounting prescribed area is excessively corroded (2.4.a.3) Nearside rear suspension spring mounting prescribed area is excessively corroded (2.4.a.3) 11 July 2014 [17:21] 11/07/2014 07 June 2011 [16:47] 07/06/2011 327532894162 327532894162 536138351153 536138351153
2 Offside rear suspension spring mounting prescribed area is excessively corroded (2.4.a.3) Offside rear suspension spring mounting prescribed area is excessively corroded (2.4.a.3) 11 July 2014 [17:21] 11/07/2014 07 June 2011 [16:47] 07/06/2011 327532894162 327532894162 536138351153 536138351153
2 Fuel cap/sealing device sealing washer missing (7.2.4c) Fuel cap/sealing device sealing washer missing (7.2.4c) 11 July 2013 [09:29] 11/07/2013 18 June 2012 [10:23] 18/06/2012 926302493132 926302493132 285910072112 285910072112
2 Offside track rod end ball joint dust cover damaged, but preventing the ingress of dirt (2.2.c.1c) Offside track rod end ball joint dust cover damaged, but preventing the ingress of dirt (2.2.c.1c) 25 June 2012 [10:21] 25/06/2012 18 June 2012 [10:23] 18/06/2012 226427472448 226427472448 285910072112 285910072112
2 Rear differential leaking. Rear differential leaking. 25 June 2012 [10:21] 25/06/2012 18 June 2012 [10:23] 18/06/2012 226427472448 226427472448 285910072112 285910072112
2 Leak from near side rear brake drum. Leak from near side rear brake drum. 25 June 2012 [10:21] 25/06/2012 18 June 2012 [10:23] 18/06/2012 226427472448 226427472448 285910072112 285910072112

ALL KAE 104B ADVISORIES [3]

ALL ADVISORIES, ORDERED by OCCURRENCE DURING KAE 104B's MOT HISTORY
ALL KAE 104B ADVISORIES [3]
ALL ADVISORIES, ORDERED by OCCURRENCE DURING KAE 104B's MOT HISTORY
Advisory Faults | source www.vehiclestats.co.uk
Fault Fault Test Date Test Date/Time Reference MOT Test Reference
2 Offside track rod end ball joint dust cover damaged, but preventing the ingress of dirt (2.2.c.1c) Offside track rod end ball joint dust cover damaged, but preventing the ingress of dirt (2.2.c.1c) 25 June 2012 [10:21] 25/06/2012 18 June 2012 [10:23] 18/06/2012 226427472448 226427472448 285910072112 285910072112
1 Nearside front lower torque/reaction arm has slight play in a pin/bush (2.4.g.2) Nearside front lower torque/reaction arm has slight play in a pin/bush (2.4.g.2) 06 October 2006 [11:11] 06/10/2006 270609376266 270609376266

ALL KAE 104B Failure Faults [29]

ALL Failure faults, ORDERED by OCCURRENCE DURING KAE 104B's MOT HISTORY
ALL KAE 104B Failure Faults [29]
ALL Failure faults, ORDERED by OCCURRENCE DURING KAE 104B's MOT HISTORY
Fail Faults | source www.vehiclestats.co.uk
Fault Fault Test Date Test Date/Time Reference MOT Test Reference
3 Parking brake: efficiency below requirements (3.7.b.7) Parking brake: efficiency below requirements (3.7.b.7) 21 July 2016 [08:15] 21/07/2016 11 July 2014 [17:21] 11/07/2014 11 July 2013 [09:29] 11/07/2013 141474735628 141474735628 327532894162 327532894162 926302493132 926302493132
2 Brakes imbalanced across an axle (3.7.b.5b) Brakes imbalanced across an axle (3.7.b.5b) 21 July 2016 [08:15] 21/07/2016 18 June 2012 [10:23] 18/06/2012 141474735628 141474735628 285910072112 285910072112
2 Nearside headlamp aim too high (1.8) Nearside headlamp aim too high (1.8) 21 July 2016 [08:15] 21/07/2016 18 June 2012 [10:23] 18/06/2012 141474735628 141474735628 285910072112 285910072112
2 Nearside front suspension component mounting prescribed area is excessively corroded (2.4.a.3) Nearside front suspension component mounting prescribed area is excessively corroded (2.4.a.3) 03 July 2015 [12:58] 03/07/2015 11 July 2014 [17:21] 11/07/2014 138884885184 138884885184 327532894162 327532894162
2 Nearside rear suspension spring mounting prescribed area is excessively corroded (2.4.a.3) Nearside rear suspension spring mounting prescribed area is excessively corroded (2.4.a.3) 11 July 2014 [17:21] 11/07/2014 07 June 2011 [16:47] 07/06/2011 327532894162 327532894162 536138351153 536138351153
2 Offside rear suspension spring mounting prescribed area is excessively corroded (2.4.a.3) Offside rear suspension spring mounting prescribed area is excessively corroded (2.4.a.3) 11 July 2014 [17:21] 11/07/2014 07 June 2011 [16:47] 07/06/2011 327532894162 327532894162 536138351153 536138351153
2 Fuel cap/sealing device sealing washer missing (7.2.4c) Fuel cap/sealing device sealing washer missing (7.2.4c) 11 July 2013 [09:29] 11/07/2013 18 June 2012 [10:23] 18/06/2012 926302493132 926302493132 285910072112 285910072112
1 Offside headlamp aim beam image obviously incorrect (1.8.a.1b) Offside headlamp aim beam image obviously incorrect (1.8.a.1b) 21 July 2016 [08:15] 21/07/2016 141474735628 141474735628
1 Nearside track rod end ball joint has excessive play (2.2.b.1f) Nearside track rod end ball joint has excessive play (2.2.b.1f) 21 July 2016 [08:15] 21/07/2016 141474735628 141474735628
1 Nearside rear brake binding (3.7.b.1) Nearside rear brake binding (3.7.b.1) 03 July 2015 [12:58] 03/07/2015 138884885184 138884885184
1 Offside rear brake binding (3.7.b.1) Offside rear brake binding (3.7.b.1) 03 July 2015 [12:58] 03/07/2015 138884885184 138884885184
1 Service brake: efficiency below requirements (3.7.b.7) Service brake: efficiency below requirements (3.7.b.7) 11 July 2014 [17:21] 11/07/2014 327532894162 327532894162
1 Offside front position lamp(s) not working (1.1.a.3b) Offside front position lamp(s) not working (1.1.a.3b) 11 July 2013 [09:29] 11/07/2013 926302493132 926302493132
1 Nearside rear position lamp(s) not working (1.1.a.3b) Nearside rear position lamp(s) not working (1.1.a.3b) 11 July 2013 [09:29] 11/07/2013 926302493132 926302493132
1 Registration plate lamp not working (1.1.c.1d) Registration plate lamp not working (1.1.c.1d) 11 July 2013 [09:29] 11/07/2013 926302493132 926302493132
1 Braking system leaking (3.6.a.1) Braking system leaking (3.6.a.1) 11 July 2013 [09:29] 11/07/2013 926302493132 926302493132
1 Offside front seat belt anchorage prescribed area is excessively corroded (5.2.6) Offside front seat belt anchorage prescribed area is excessively corroded (5.2.6) 11 July 2013 [09:29] 11/07/2013 926302493132 926302493132
1 Nearside front suspension spring mounting prescribed area is excessively corroded (2.4.a.3) Nearside front suspension spring mounting prescribed area is excessively corroded (2.4.a.3) 07 June 2011 [16:47] 07/06/2011 536138351153 536138351153
1 Offside front lower torque/reaction arm has excessive play in a pin/bush (2.4.g.2) Offside front lower torque/reaction arm has excessive play in a pin/bush (2.4.g.2) 06 October 2006 [11:11] 06/10/2006 270609376266 270609376266
1 Nearside front upper torque/reaction arm has excessive play in a pin/bush (2.4.g.2) Nearside front upper torque/reaction arm has excessive play in a pin/bush (2.4.g.2) 06 October 2006 [11:11] 06/10/2006 270609376266 270609376266
1 Nearside front headlamp not working on dipped beam (1.7.5a) Nearside front headlamp not working on dipped beam (1.7.5a) 06 October 2006 [11:11] 06/10/2006 270609376266 270609376266

ALL KAE 104B User Entered Faults [5]

ALL User Entered faults, ORDERED by OCCURRENCE DURING KAE 104B's MOT HISTORY
ALL KAE 104B User Entered Faults [5]
ALL User Entered faults, ORDERED by OCCURRENCE DURING KAE 104B's MOT HISTORY
Advisory Faults | source www.vehiclestats.co.uk
Fault Fault Test Date Test Date/Time Reference MOT Test Reference
2 Rear differential leaking. Rear differential leaking. 25 June 2012 [10:21] 25/06/2012 18 June 2012 [10:23] 18/06/2012 226427472448 226427472448 285910072112 285910072112
2 Leak from near side rear brake drum. Leak from near side rear brake drum. 25 June 2012 [10:21] 25/06/2012 18 June 2012 [10:23] 18/06/2012 226427472448 226427472448 285910072112 285910072112
1 Slight corrosion to welded repair, n/s/f floor under side. Slight corrosion to welded repair, n/s/f floor under side. 11 July 2014 [17:21] 11/07/2014 327532894162 327532894162

MOT TEST: 01 August 2017 14:17:15 PASSED
MOT TEST: 01 August 2017 14:17:15 PASSED

This test (535459509672) was completed on the 01 August 2017 14:17:15 and PASSED the requirements for a valid MOT with 0 comments.

This test (535459509672) was completed on the 01 August 2017 14:17:15 and PASSED the requirements for a valid MOT with 0 comments.

Recorded mileage: 37,510

Recorded mileage: 37,510


MOT TEST: 21 July 2016 15:42:25 PASSED
MOT TEST: 21 July 2016 15:42:25 PASSED

This test (336494126943) was completed on the 21 July 2016 15:42:25 and PASSED the requirements for a valid MOT with 0 comments.

This test (336494126943) was completed on the 21 July 2016 15:42:25 and PASSED the requirements for a valid MOT with 0 comments.

Recorded mileage: 37,320

Recorded mileage: 37,320


MOT TEST: 21 July 2016 08:15:05 FAILED
MOT TEST: 21 July 2016 08:15:05 FAILED

This test (141474735628) was completed on the 21 July 2016 08:15:05 and FAILED the requirements for a valid MOT with 5 comments.

This test (141474735628) was completed on the 21 July 2016 08:15:05 and FAILED the requirements for a valid MOT with 5 comments.

Recorded mileage: 37,320

Recorded mileage: 37,320


FAIL


MOT TEST: 08 July 2015 13:53:39 PASSED
MOT TEST: 08 July 2015 13:53:39 PASSED

This test (486379385177) was completed on the 08 July 2015 13:53:39 and PASSED the requirements for a valid MOT with 0 comments.

This test (486379385177) was completed on the 08 July 2015 13:53:39 and PASSED the requirements for a valid MOT with 0 comments.

Recorded mileage: 36,096

Recorded mileage: 36,096


MOT TEST: 03 July 2015 12:58:43 FAILED
MOT TEST: 03 July 2015 12:58:43 FAILED

This test (138884885184) was completed on the 03 July 2015 12:58:43 and FAILED the requirements for a valid MOT with 3 comments.

This test (138884885184) was completed on the 03 July 2015 12:58:43 and FAILED the requirements for a valid MOT with 3 comments.

Recorded mileage: 36,085

Recorded mileage: 36,085


FAIL


MOT TEST: 07 August 2014 15:43:46 PASSED
MOT TEST: 07 August 2014 15:43:46 PASSED

This test (178729714271) was completed on the 07 August 2014 15:43:46 and PASSED the requirements for a valid MOT with 0 comments.

This test (178729714271) was completed on the 07 August 2014 15:43:46 and PASSED the requirements for a valid MOT with 0 comments.

Recorded mileage: 35,438

Recorded mileage: 35,438


MOT TEST: 11 July 2014 17:21:10 FAILED
MOT TEST: 11 July 2014 17:21:10 FAILED

This test (327532894162) was completed on the 11 July 2014 17:21:10 and FAILED the requirements for a valid MOT with 6 comments.

This test (327532894162) was completed on the 11 July 2014 17:21:10 and FAILED the requirements for a valid MOT with 6 comments.

Recorded mileage: 35,438

Recorded mileage: 35,438


FAIL

USER ENTERED


MOT TEST: 12 July 2013 12:27:49 PASSED
MOT TEST: 12 July 2013 12:27:49 PASSED

This test (275343693493) was completed on the 12 July 2013 12:27:49 and PASSED the requirements for a valid MOT with 0 comments.

This test (275343693493) was completed on the 12 July 2013 12:27:49 and PASSED the requirements for a valid MOT with 0 comments.

Recorded mileage: 35,246

Recorded mileage: 35,246


MOT TEST: 11 July 2013 09:29:06 FAILED
MOT TEST: 11 July 2013 09:29:06 FAILED

This test (926302493132) was completed on the 11 July 2013 09:29:06 and FAILED the requirements for a valid MOT with 7 comments.

This test (926302493132) was completed on the 11 July 2013 09:29:06 and FAILED the requirements for a valid MOT with 7 comments.

Recorded mileage: 35,246

Recorded mileage: 35,246


FAIL


MOT TEST: 25 June 2012 10:21:23 PASSED
MOT TEST: 25 June 2012 10:21:23 PASSED

This test (226427472448) was completed on the 25 June 2012 10:21:23 and PASSED the requirements for a valid MOT with 3 comments.

This test (226427472448) was completed on the 25 June 2012 10:21:23 and PASSED the requirements for a valid MOT with 3 comments.

Recorded mileage: 24,841

Recorded mileage: 24,841


ADVISORY

USER ENTERED


MOT TEST: 18 June 2012 10:23:03 FAILED
MOT TEST: 18 June 2012 10:23:03 FAILED

This test (285910072112) was completed on the 18 June 2012 10:23:03 and FAILED the requirements for a valid MOT with 6 comments.

This test (285910072112) was completed on the 18 June 2012 10:23:03 and FAILED the requirements for a valid MOT with 6 comments.

Recorded mileage: 24,440

Recorded mileage: 24,440


ADVISORY

FAIL

USER ENTERED


MOT TEST: 16 June 2011 15:59:17 PASSED
MOT TEST: 16 June 2011 15:59:17 PASSED

This test (736337061110) was completed on the 16 June 2011 15:59:17 and PASSED the requirements for a valid MOT with 0 comments.

This test (736337061110) was completed on the 16 June 2011 15:59:17 and PASSED the requirements for a valid MOT with 0 comments.

Recorded mileage: 7,457

Recorded mileage: 7,457


MOT TEST: 07 June 2011 16:47:08 FAILED
MOT TEST: 07 June 2011 16:47:08 FAILED

This test (536138351153) was completed on the 07 June 2011 16:47:08 and FAILED the requirements for a valid MOT with 3 comments.

This test (536138351153) was completed on the 07 June 2011 16:47:08 and FAILED the requirements for a valid MOT with 3 comments.

Recorded mileage: 7,457

Recorded mileage: 7,457


FAIL


MOT TEST: 19 October 2006 11:34:26 PASSED
MOT TEST: 19 October 2006 11:34:26 PASSED

This test (433102896299) was completed on the 19 October 2006 11:34:26 and PASSED the requirements for a valid MOT with 0 comments.

This test (433102896299) was completed on the 19 October 2006 11:34:26 and PASSED the requirements for a valid MOT with 0 comments.

Recorded mileage: 71,875

Recorded mileage: 71,875


MOT TEST: 06 October 2006 11:11:20 FAILED
MOT TEST: 06 October 2006 11:11:20 FAILED

This test (270609376266) was completed on the 06 October 2006 11:11:20 and FAILED the requirements for a valid MOT with 4 comments.

This test (270609376266) was completed on the 06 October 2006 11:11:20 and FAILED the requirements for a valid MOT with 4 comments.

Recorded mileage: 71,875

Recorded mileage: 71,875


ADVISORY

FAIL