KDB 157F


KDB157F is registered to a Black 1967, Morris Minor 1000 with a Petrol engine. It Failed its most recent MOT Test on the 01 August 2006

9 unique faults (9 Total) reported in its MOT History (2 Tests).

0 common/recurring faults.

50% (1) MOT Pass Rate and a 50% (1) MOT Failure Rate.

77,026 recorded miles.

KDB 157F


KDB157F is registered to a Black 1967, Morris Minor 1000 with a Petrol engine. It Failed its most recent MOT Test on the 01 August 2006

9 unique faults (9 Total) reported in its MOT History (2 Tests).

0 common/recurring faults.

50% (1) MOT Pass Rate and a 50% (1) MOT Failure Rate.

77,026 recorded miles.

MOT PASS/Failure rate for KDB 157F

all MOT test results for KDB 157F represented as a percentage
MOT PASS/Failure rate for KDB 157F
all MOT test results for KDB 157F represented as a percentage

PERCENTAGE OF VEHICLE FAULTS WITH KDB 157F

ALL REPORTED FAULTS, DISPLAYED BY PERCENTAGE OF OCCURRENCE DURING ALL MOT TESTS
PERCENTAGE OF VEHICLE FAULTS WITH KDB 157F
ALL REPORTED FAULTS, DISPLAYED BY PERCENTAGE OF OCCURRENCE DURING ALL MOT TESTS
FAIL

USER ENTERED

KDB 157F annual Faults by type

ALL REPORTED FAULTS, DISPLAYED over time and categorised by type
KDB 157F annual Faults by type
ALL REPORTED FAULTS, DISPLAYED over time and categorised by type

ALL KDB 157F Failure Faults [8]

ALL Failure faults, ORDERED by OCCURRENCE DURING KDB 157F's MOT HISTORY
ALL KDB 157F Failure Faults [8]
ALL Failure faults, ORDERED by OCCURRENCE DURING KDB 157F's MOT HISTORY
Fail Faults | source www.vehiclestats.co.uk
Fault Fault Test Date Test Date/Time Reference MOT Test Reference
1 Nearside rear suspension component mounting prescribed area is excessively corroded (2.4.a.3) Nearside rear suspension component mounting prescribed area is excessively corroded (2.4.a.3) 25 July 2006 [15:03] 25/07/2006 421316406287 421316406287
1 Offside front brake master cylinder/servo mounting prescribed area is excessively corroded (3.6.c.3) Offside front brake master cylinder/servo mounting prescribed area is excessively corroded (3.6.c.3) 25 July 2006 [15:03] 25/07/2006 421316406287 421316406287
1 Registration plate lamp not working (1.1.5c) Registration plate lamp not working (1.1.5c) 25 July 2006 [15:03] 25/07/2006 421316406287 421316406287
1 Windscreen washer provides insufficient washer liquid (8.2.3) Windscreen washer provides insufficient washer liquid (8.2.3) 25 July 2006 [15:03] 25/07/2006 421316406287 421316406287
1 Front exhaust has a major leak of exhaust gases (7.1.2) Front exhaust has a major leak of exhaust gases (7.1.2) 25 July 2006 [15:03] 25/07/2006 421316406287 421316406287
1 Offside front brake hose excessively deteriorated (3.6.b.4d) Offside front brake hose excessively deteriorated (3.6.b.4d) 25 July 2006 [15:03] 25/07/2006 421316406287 421316406287
1 Parking brake: efficiency below requirements (3.7.b.7) Parking brake: efficiency below requirements (3.7.b.7) 25 July 2006 [15:03] 25/07/2006 421316406287 421316406287
1 Brakes imbalanced across an axle (3.7.b.5b) Brakes imbalanced across an axle (3.7.b.5b) 25 July 2006 [15:03] 25/07/2006 421316406287 421316406287

ALL KDB 157F User Entered Faults [1]

ALL User Entered faults, ORDERED by OCCURRENCE DURING KDB 157F's MOT HISTORY
ALL KDB 157F User Entered Faults [1]
ALL User Entered faults, ORDERED by OCCURRENCE DURING KDB 157F's MOT HISTORY
Fail Faults | source www.vehiclestats.co.uk
Fault Fault Test Date Test Date/Time Reference MOT Test Reference
1 Rear tyres getting low Rear tyres getting low 25 July 2006 [15:03] 25/07/2006 421316406287 421316406287

MOT TEST: 01 August 2006 08:29:29 PASSED
MOT TEST: 01 August 2006 08:29:29 PASSED

This test (854073116212) was completed on the 01 August 2006 08:29:29 and PASSED the requirements for a valid MOT with 0 comments.

This test (854073116212) was completed on the 01 August 2006 08:29:29 and PASSED the requirements for a valid MOT with 0 comments.

Recorded mileage: 77,026

Recorded mileage: 77,026


MOT TEST: 25 July 2006 15:03:03 FAILED
MOT TEST: 25 July 2006 15:03:03 FAILED

This test (421316406287) was completed on the 25 July 2006 15:03:03 and FAILED the requirements for a valid MOT with 9 comments.

This test (421316406287) was completed on the 25 July 2006 15:03:03 and FAILED the requirements for a valid MOT with 9 comments.

Recorded mileage: 77,026

Recorded mileage: 77,026


FAIL

USER ENTERED