KDB 979F


KDB979F is registered to a Green 1967, Morris Minor 1000 with a Petrol engine. It Failed its most recent MOT Test on the 01 May 2013

37 unique faults (49 Total) reported in its MOT History (8 Tests).

12 common/recurring faults, the most frequent (2 times) is: Rear Registration plate lamp not working (1.1.C.1d).

50% (4) MOT Pass Rate and a 50% (4) MOT Failure Rate.

33,075 recorded miles.

KDB 979F


KDB979F is registered to a Green 1967, Morris Minor 1000 with a Petrol engine. It Failed its most recent MOT Test on the 01 May 2013

37 unique faults (49 Total) reported in its MOT History (8 Tests).

12 common/recurring faults, the most frequent (2 times) is: Rear Registration plate lamp not working (1.1.C.1d).

50% (4) MOT Pass Rate and a 50% (4) MOT Failure Rate.

33,075 recorded miles.

MOT PASS/Failure rate for KDB 979F

all MOT test results for KDB 979F represented as a percentage
MOT PASS/Failure rate for KDB 979F
all MOT test results for KDB 979F represented as a percentage

PERCENTAGE OF VEHICLE FAULTS WITH KDB 979F

ALL REPORTED FAULTS, DISPLAYED BY PERCENTAGE OF OCCURRENCE DURING ALL MOT TESTS
PERCENTAGE OF VEHICLE FAULTS WITH KDB 979F
ALL REPORTED FAULTS, DISPLAYED BY PERCENTAGE OF OCCURRENCE DURING ALL MOT TESTS
ADVISORY

FAIL

USER ENTERED

KDB 979F annual Faults by type

ALL REPORTED FAULTS, DISPLAYED over time and categorised by type
KDB 979F annual Faults by type
ALL REPORTED FAULTS, DISPLAYED over time and categorised by type

RECURRING FAULTS WITH KDB 979F

FAULTS THAT HAVE OCCURED MORE THAN ONCE DURING KDB 979F's MOT HISTORY
RECURRING FAULTS WITH KDB 979F
FAULTS THAT HAVE OCCURED MORE THAN ONCE DURING KDB 979F's MOT HISTORY
Fault Fault Test Date Test Date/Time Reference MOT Test Reference
2 Rear registration plate lamp not working (1.1.c.1d) Rear registration plate lamp not working (1.1.c.1d) 01 May 2013 [17:02] 01/05/2013 08 November 2010 [12:35] 08/11/2010 247801523101 247801523101 762572110366 762572110366
2 Offside front brake binding (3.7.b.1) Offside front brake binding (3.7.b.1) 01 May 2013 [17:02] 01/05/2013 22 March 2012 [11:10] 22/03/2012 247801523101 247801523101 117672982085 117672982085
2 Fuel cap/sealing device sealing washer missing (7.2.4c) Fuel cap/sealing device sealing washer missing (7.2.4c) 08 November 2010 [12:35] 08/11/2010 09 October 2009 [12:26] 09/10/2009 762572110366 762572110366 293582789269 293582789269
2 Clutch low Clutch low 16 October 2009 [15:50] 16/10/2009 09 October 2009 [12:26] 09/10/2009 312429889419 312429889419 293582789269 293582789269
2 O/s/f seat sagging badly O/s/f seat sagging badly 16 October 2009 [15:50] 16/10/2009 09 October 2009 [12:26] 09/10/2009 312429889419 312429889419 293582789269 293582789269
2 Front tyres cracking Front tyres cracking 16 October 2009 [15:50] 16/10/2009 09 October 2009 [12:26] 09/10/2009 312429889419 312429889419 293582789269 293582789269
2 Corrosion to o/s/f chassis leg/valance Corrosion to o/s/f chassis leg/valance 16 October 2009 [15:50] 16/10/2009 09 October 2009 [12:26] 09/10/2009 312429889419 312429889419 293582789269 293582789269
2 Corrosion around n/s/f bump stop Corrosion around n/s/f bump stop 16 October 2009 [15:50] 16/10/2009 09 October 2009 [12:26] 09/10/2009 312429889419 312429889419 293582789269 293582789269
2 Corrosion o/s/r wheel arch Corrosion o/s/r wheel arch 16 October 2009 [15:50] 16/10/2009 09 October 2009 [12:26] 09/10/2009 312429889419 312429889419 293582789269 293582789269
2 O/s/r tyre worn to limit and cracked O/s/r tyre worn to limit and cracked 16 October 2009 [15:50] 16/10/2009 09 October 2009 [12:26] 09/10/2009 312429889419 312429889419 293582789269 293582789269
2 Rear exhaust mount deteriorated Rear exhaust mount deteriorated 16 October 2009 [15:50] 16/10/2009 09 October 2009 [12:26] 09/10/2009 312429889419 312429889419 293582789269 293582789269
2 Rear spring shackle bushes deteriorated Rear spring shackle bushes deteriorated 16 October 2009 [15:50] 16/10/2009 09 October 2009 [12:26] 09/10/2009 312429889419 312429889419 293582789269 293582789269

ALL KDB 979F ADVISORIES [1]

ALL ADVISORIES, ORDERED by OCCURRENCE DURING KDB 979F's MOT HISTORY
ALL KDB 979F ADVISORIES [1]
ALL ADVISORIES, ORDERED by OCCURRENCE DURING KDB 979F's MOT HISTORY
Fail Faults | source www.vehiclestats.co.uk
Fault Fault Test Date Test Date/Time Reference MOT Test Reference
1 Front brake pipe slightly corroded (3.6.b.2c) Front brake pipe slightly corroded (3.6.b.2c) 08 November 2010 [12:35] 08/11/2010 762572110366 762572110366

ALL KDB 979F Failure Faults [28]

ALL Failure faults, ORDERED by OCCURRENCE DURING KDB 979F's MOT HISTORY
ALL KDB 979F Failure Faults [28]
ALL Failure faults, ORDERED by OCCURRENCE DURING KDB 979F's MOT HISTORY
Fail Faults | source www.vehiclestats.co.uk
Fault Fault Test Date Test Date/Time Reference MOT Test Reference
2 Rear registration plate lamp not working (1.1.c.1d) Rear registration plate lamp not working (1.1.c.1d) 01 May 2013 [17:02] 01/05/2013 08 November 2010 [12:35] 08/11/2010 247801523101 247801523101 762572110366 762572110366
2 Offside front brake binding (3.7.b.1) Offside front brake binding (3.7.b.1) 01 May 2013 [17:02] 01/05/2013 22 March 2012 [11:10] 22/03/2012 247801523101 247801523101 117672982085 117672982085
2 Fuel cap/sealing device sealing washer missing (7.2.4c) Fuel cap/sealing device sealing washer missing (7.2.4c) 08 November 2010 [12:35] 08/11/2010 09 October 2009 [12:26] 09/10/2009 762572110366 762572110366 293582789269 293582789269
1 Nearside rear suspension spring mounting prescribed area is excessively corroded (2.4.a.3) Nearside rear suspension spring mounting prescribed area is excessively corroded (2.4.a.3) 01 May 2013 [17:02] 01/05/2013 247801523101 247801523101
1 Offside rear suspension spring mounting prescribed area is excessively corroded (2.4.a.3) Offside rear suspension spring mounting prescribed area is excessively corroded (2.4.a.3) 01 May 2013 [17:02] 01/05/2013 247801523101 247801523101
1 Offside steering rack gaiter split (2.2.d.2d) Offside steering rack gaiter split (2.2.d.2d) 01 May 2013 [17:02] 01/05/2013 247801523101 247801523101
1 Nearside front brake binding (3.7.b.1) Nearside front brake binding (3.7.b.1) 01 May 2013 [17:02] 01/05/2013 247801523101 247801523101
1 Offside rear parking brake recording little or no effort (3.7.b.6a) Offside rear parking brake recording little or no effort (3.7.b.6a) 01 May 2013 [17:02] 01/05/2013 247801523101 247801523101
1 Offside seat belt anchorage prescribed area is excessively corroded (5.2.6) Offside seat belt anchorage prescribed area is excessively corroded (5.2.6) 01 May 2013 [17:02] 01/05/2013 247801523101 247801523101
1 Brake pedal creeps down when held under pressure (3.3.b.1a) Brake pedal creeps down when held under pressure (3.3.b.1a) 01 May 2013 [17:02] 01/05/2013 247801523101 247801523101
1 Parking brake: efficiency below requirements (3.7.b.7) Parking brake: efficiency below requirements (3.7.b.7) 01 May 2013 [17:02] 01/05/2013 247801523101 247801523101
1 Nearside steering rack gaiter split (2.2.d.2d) Nearside steering rack gaiter split (2.2.d.2d) 22 March 2012 [11:10] 22/03/2012 117672982085 117672982085
1 Offside rear lower seat belt anchorage prescribed area is excessively corroded (5.2.6) Offside rear lower seat belt anchorage prescribed area is excessively corroded (5.2.6) 22 March 2012 [11:10] 22/03/2012 117672982085 117672982085
1 Nearside headlamp aim too high (1.8) Nearside headlamp aim too high (1.8) 08 November 2010 [12:35] 08/11/2010 762572110366 762572110366
1 Offside front suspension component mounting prescribed area is excessively corroded (2.4.a.3) Offside front suspension component mounting prescribed area is excessively corroded (2.4.a.3) 08 November 2010 [12:35] 08/11/2010 762572110366 762572110366
1 Front brake pipe inadequately clipped (3.6.b.1) Front brake pipe inadequately clipped (3.6.b.1) 08 November 2010 [12:35] 08/11/2010 762572110366 762572110366
1 Offside rear tyre tread depth below requirements of 1.6mm (4.1.e.1) Offside rear tyre tread depth below requirements of 1.6mm (4.1.e.1) 08 November 2010 [12:35] 08/11/2010 762572110366 762572110366
1 Offside front tyre tread depth below requirements of 1.6mm (4.1.e.1) Offside front tyre tread depth below requirements of 1.6mm (4.1.e.1) 08 November 2010 [12:35] 08/11/2010 762572110366 762572110366
1 Windscreen washer provides insufficient washer liquid (8.2.3) Windscreen washer provides insufficient washer liquid (8.2.3) 09 October 2009 [12:26] 09/10/2009 293582789269 293582789269
1 Nearside headlamp not working on dipped beam (1.7.5a) Nearside headlamp not working on dipped beam (1.7.5a) 09 October 2009 [12:26] 09/10/2009 293582789269 293582789269
1 Offside headlamp not working on main beam (1.7.5a) Offside headlamp not working on main beam (1.7.5a) 09 October 2009 [12:26] 09/10/2009 293582789269 293582789269
1 Offside front position lamp(s) not working (1.1.a.3b) Offside front position lamp(s) not working (1.1.a.3b) 09 October 2009 [12:26] 09/10/2009 293582789269 293582789269
1 Offside headlamp aim too low (1.8) Offside headlamp aim too low (1.8) 09 October 2009 [12:26] 09/10/2009 293582789269 293582789269
1 Nearside front tyre tread depth below requirements of 1.6mm (4.1.e.1) Nearside front tyre tread depth below requirements of 1.6mm (4.1.e.1) 09 October 2009 [12:26] 09/10/2009 293582789269 293582789269
1 Nearside front suspension component mounting prescribed area is fractured (2.4.a.3) Nearside front suspension component mounting prescribed area is fractured (2.4.a.3) 09 October 2009 [12:26] 09/10/2009 293582789269 293582789269

ALL KDB 979F User Entered Faults [20]

ALL User Entered faults, ORDERED by OCCURRENCE DURING KDB 979F's MOT HISTORY
ALL KDB 979F User Entered Faults [20]
ALL User Entered faults, ORDERED by OCCURRENCE DURING KDB 979F's MOT HISTORY
User Entered Faults | source www.vehiclestats.co.uk
Fault Fault Test Date Test Date/Time Reference MOT Test Reference
2 Clutch low Clutch low 16 October 2009 [15:50] 16/10/2009 09 October 2009 [12:26] 09/10/2009 312429889419 312429889419 293582789269 293582789269
2 O/s/f seat sagging badly O/s/f seat sagging badly 16 October 2009 [15:50] 16/10/2009 09 October 2009 [12:26] 09/10/2009 312429889419 312429889419 293582789269 293582789269
2 Front tyres cracking Front tyres cracking 16 October 2009 [15:50] 16/10/2009 09 October 2009 [12:26] 09/10/2009 312429889419 312429889419 293582789269 293582789269
2 Corrosion to o/s/f chassis leg/valance Corrosion to o/s/f chassis leg/valance 16 October 2009 [15:50] 16/10/2009 09 October 2009 [12:26] 09/10/2009 312429889419 312429889419 293582789269 293582789269
2 Corrosion around n/s/f bump stop Corrosion around n/s/f bump stop 16 October 2009 [15:50] 16/10/2009 09 October 2009 [12:26] 09/10/2009 312429889419 312429889419 293582789269 293582789269
2 Corrosion o/s/r wheel arch Corrosion o/s/r wheel arch 16 October 2009 [15:50] 16/10/2009 09 October 2009 [12:26] 09/10/2009 312429889419 312429889419 293582789269 293582789269
2 O/s/r tyre worn to limit and cracked O/s/r tyre worn to limit and cracked 16 October 2009 [15:50] 16/10/2009 09 October 2009 [12:26] 09/10/2009 312429889419 312429889419 293582789269 293582789269
2 Rear exhaust mount deteriorated Rear exhaust mount deteriorated 16 October 2009 [15:50] 16/10/2009 09 October 2009 [12:26] 09/10/2009 312429889419 312429889419 293582789269 293582789269
2 Rear spring shackle bushes deteriorated Rear spring shackle bushes deteriorated 16 October 2009 [15:50] 16/10/2009 09 October 2009 [12:26] 09/10/2009 312429889419 312429889419 293582789269 293582789269
1 Corrosion under offside rear wheel arch Corrosion under offside rear wheel arch 22 March 2012 [14:06] 22/03/2012 418322082075 418322082075
1 N/s/f tyre worn on outer edge N/s/f tyre worn on outer edge 09 October 2009 [12:26] 09/10/2009 293582789269 293582789269

MOT TEST: 01 May 2013 17:02:51 FAILED
MOT TEST: 01 May 2013 17:02:51 FAILED

This test (247801523101) was completed on the 01 May 2013 17:02:51 and FAILED the requirements for a valid MOT with 10 comments.

This test (247801523101) was completed on the 01 May 2013 17:02:51 and FAILED the requirements for a valid MOT with 10 comments.

Recorded mileage: 33,075

Recorded mileage: 33,075


FAIL


MOT TEST: 22 March 2012 14:06:28 PASSED
MOT TEST: 22 March 2012 14:06:28 PASSED

This test (418322082075) was completed on the 22 March 2012 14:06:28 and PASSED the requirements for a valid MOT with 1 comments.

This test (418322082075) was completed on the 22 March 2012 14:06:28 and PASSED the requirements for a valid MOT with 1 comments.

Recorded mileage: 31,133

Recorded mileage: 31,133


USER ENTERED


MOT TEST: 22 March 2012 11:10:49 FAILED
MOT TEST: 22 March 2012 11:10:49 FAILED

This test (117672982085) was completed on the 22 March 2012 11:10:49 and FAILED the requirements for a valid MOT with 3 comments.

This test (117672982085) was completed on the 22 March 2012 11:10:49 and FAILED the requirements for a valid MOT with 3 comments.

Recorded mileage: 31,133

Recorded mileage: 31,133


FAIL


MOT TEST: 09 November 2010 17:11:38 PASSED
MOT TEST: 09 November 2010 17:11:38 PASSED

This test (300533410384) was completed on the 09 November 2010 17:11:38 and PASSED the requirements for a valid MOT with 0 comments.

This test (300533410384) was completed on the 09 November 2010 17:11:38 and PASSED the requirements for a valid MOT with 0 comments.

Recorded mileage: 30,108

Recorded mileage: 30,108


MOT TEST: 08 November 2010 12:35:14 FAILED
MOT TEST: 08 November 2010 12:35:14 FAILED

This test (762572110366) was completed on the 08 November 2010 12:35:14 and FAILED the requirements for a valid MOT with 8 comments.

This test (762572110366) was completed on the 08 November 2010 12:35:14 and FAILED the requirements for a valid MOT with 8 comments.

Recorded mileage: 30,096

Recorded mileage: 30,096


ADVISORY

FAIL


MOT TEST: 16 October 2009 15:50:24 PASSED
MOT TEST: 16 October 2009 15:50:24 PASSED

This test (312429889419) was completed on the 16 October 2009 15:50:24 and PASSED the requirements for a valid MOT with 9 comments.

This test (312429889419) was completed on the 16 October 2009 15:50:24 and PASSED the requirements for a valid MOT with 9 comments.

Recorded mileage: 27,014

Recorded mileage: 27,014


USER ENTERED


MOT TEST: 09 October 2009 12:26:08 FAILED
MOT TEST: 09 October 2009 12:26:08 FAILED

This test (293582789269) was completed on the 09 October 2009 12:26:08 and FAILED the requirements for a valid MOT with 18 comments.

This test (293582789269) was completed on the 09 October 2009 12:26:08 and FAILED the requirements for a valid MOT with 18 comments.

Recorded mileage: 26,958

Recorded mileage: 26,958


FAIL

USER ENTERED


MOT TEST: 28 October 2008 16:28:17 PASSED
MOT TEST: 28 October 2008 16:28:17 PASSED

This test (291422308340) was completed on the 28 October 2008 16:28:17 and PASSED the requirements for a valid MOT with 0 comments.

This test (291422308340) was completed on the 28 October 2008 16:28:17 and PASSED the requirements for a valid MOT with 0 comments.

Recorded mileage: 24,271

Recorded mileage: 24,271