KDD 638E


KDD638E is registered to a Red 1967, Morris Minor with a Petrol engine. It Passed its most recent MOT Test on the 23 May 2018

17 unique faults (21 Total) reported in its MOT History (15 Tests).

4 common/recurring faults, the most frequent (2 times) is: front offside and front nearside lower trunnions have slight play..

73% (11) MOT Pass Rate and a 27% (4) MOT Failure Rate.

32,206 recorded miles.

KDD 638E


KDD638E is registered to a Red 1967, Morris Minor with a Petrol engine. It Passed its most recent MOT Test on the 23 May 2018

17 unique faults (21 Total) reported in its MOT History (15 Tests).

4 common/recurring faults, the most frequent (2 times) is: front offside and front nearside lower trunnions have slight play..

73% (11) MOT Pass Rate and a 27% (4) MOT Failure Rate.

32,206 recorded miles.

MOT PASS/Failure rate for KDD 638E

all MOT test results for KDD 638E represented as a percentage
MOT PASS/Failure rate for KDD 638E
all MOT test results for KDD 638E represented as a percentage

PERCENTAGE OF VEHICLE FAULTS WITH KDD 638E

ALL REPORTED FAULTS, DISPLAYED BY PERCENTAGE OF OCCURRENCE DURING ALL MOT TESTS
PERCENTAGE OF VEHICLE FAULTS WITH KDD 638E
ALL REPORTED FAULTS, DISPLAYED BY PERCENTAGE OF OCCURRENCE DURING ALL MOT TESTS
ADVISORY

FAIL

USER ENTERED

KDD 638E annual Faults by type

ALL REPORTED FAULTS, DISPLAYED over time and categorised by type
KDD 638E annual Faults by type
ALL REPORTED FAULTS, DISPLAYED over time and categorised by type

RECURRING FAULTS WITH KDD 638E

FAULTS THAT HAVE OCCURED MORE THAN ONCE DURING KDD 638E's MOT HISTORY
RECURRING FAULTS WITH KDD 638E
FAULTS THAT HAVE OCCURED MORE THAN ONCE DURING KDD 638E's MOT HISTORY
Fault Fault Test Date Test Date/Time Reference MOT Test Reference
2 Front offside and front nearside lower trunnions have slight play. Front offside and front nearside lower trunnions have slight play. 23 May 2018 [16:04] 23/05/2018 23 May 2018 [09:01] 23/05/2018 131691667590 131691667590 913621728911 913621728911
2 Slight play in offside and nearside front bottom trunnions Slight play in offside and nearside front bottom trunnions 18 May 2016 [13:37] 18/05/2016 13 May 2016 [11:38] 13/05/2016 266424220013 266424220013 897548004841 897548004841
2 Offside rear tyre worn close to the legal limit (4.1.e.1) Offside rear tyre worn close to the legal limit (4.1.e.1) 27 May 2015 [14:29] 27/05/2015 21 May 2015 [13:40] 21/05/2015 238627145178 238627145178 616741345153 616741345153
2 Near side front sill weakend by corrosion but not within perscribed area. Near side front sill weakend by corrosion but not within perscribed area. 27 May 2015 [14:29] 27/05/2015 21 May 2015 [13:40] 21/05/2015 238627145178 238627145178 616741345153 616741345153

ALL KDD 638E ADVISORIES [6]

ALL ADVISORIES, ORDERED by OCCURRENCE DURING KDD 638E's MOT HISTORY
ALL KDD 638E ADVISORIES [6]
ALL ADVISORIES, ORDERED by OCCURRENCE DURING KDD 638E's MOT HISTORY
Advisory Faults | source www.vehiclestats.co.uk
Fault Fault Test Date Test Date/Time Reference MOT Test Reference
2 Front offside and front nearside lower trunnions have slight play. Front offside and front nearside lower trunnions have slight play. 23 May 2018 [16:04] 23/05/2018 23 May 2018 [09:01] 23/05/2018 131691667590 131691667590 913621728911 913621728911
2 Slight play in offside and nearside front bottom trunnions Slight play in offside and nearside front bottom trunnions 18 May 2016 [13:37] 18/05/2016 13 May 2016 [11:38] 13/05/2016 266424220013 266424220013 897548004841 897548004841
2 Offside rear tyre worn close to the legal limit (4.1.e.1) Offside rear tyre worn close to the legal limit (4.1.e.1) 27 May 2015 [14:29] 27/05/2015 21 May 2015 [13:40] 21/05/2015 238627145178 238627145178 616741345153 616741345153

ALL KDD 638E Failure Faults [9]

ALL Failure faults, ORDERED by OCCURRENCE DURING KDD 638E's MOT HISTORY
ALL KDD 638E Failure Faults [9]
ALL Failure faults, ORDERED by OCCURRENCE DURING KDD 638E's MOT HISTORY
Fail Faults | source www.vehiclestats.co.uk
Fault Fault Test Date Test Date/Time Reference MOT Test Reference
1 Offside front windscreen washer not working (3.5 (a)) Offside front windscreen washer not working (3.5 (a)) 23 May 2018 [09:01] 23/05/2018 913621728911 913621728911
1 Nearside front position lamp not working (4.2.1 (a)) Nearside front position lamp not working (4.2.1 (a)) 23 May 2018 [09:01] 23/05/2018 913621728911 913621728911
1 Rear brakes imbalanced across an axle axle 2 (3.7.b.5b) Rear brakes imbalanced across an axle axle 2 (3.7.b.5b) 13 May 2016 [11:38] 13/05/2016 897548004841 897548004841
1 Steering system has excessive free play detected at the steering wheel (steering rack fitted) steering wheel loose. (2.2.a.1b) Steering system has excessive free play detected at the steering wheel (steering rack fitted) steering wheel loose. (2.2.a.1b) 13 May 2016 [11:38] 13/05/2016 897548004841 897548004841
1 Nearside rear rear brake binding (3.7.b.1) Nearside rear rear brake binding (3.7.b.1) 13 May 2016 [11:38] 13/05/2016 897548004841 897548004841
1 Offside rear rear brake binding (3.7.b.1) Offside rear rear brake binding (3.7.b.1) 13 May 2016 [11:38] 13/05/2016 897548004841 897548004841
1 Nearside registration plate lamp not working (1.1.c.1d) Nearside registration plate lamp not working (1.1.c.1d) 21 May 2015 [13:40] 21/05/2015 616741345153 616741345153
1 Nearside front seat belt damaged sufficient to obstruct correct operation of the belt (5.2.2a) Nearside front seat belt damaged sufficient to obstruct correct operation of the belt (5.2.2a) 21 May 2015 [13:40] 21/05/2015 616741345153 616741345153
1 Nearside front wheel bearing has excessive play (2.5.a.3c) Nearside front wheel bearing has excessive play (2.5.a.3c) 18 April 2007 [12:03] 18/04/2007 190948307157 190948307157

ALL KDD 638E User Entered Faults [6]

ALL User Entered faults, ORDERED by OCCURRENCE DURING KDD 638E's MOT HISTORY
ALL KDD 638E User Entered Faults [6]
ALL User Entered faults, ORDERED by OCCURRENCE DURING KDD 638E's MOT HISTORY
Advisory Faults | source www.vehiclestats.co.uk
Fault Fault Test Date Test Date/Time Reference MOT Test Reference
2 Near side front sill weakend by corrosion but not within perscribed area. Near side front sill weakend by corrosion but not within perscribed area. 27 May 2015 [14:29] 27/05/2015 21 May 2015 [13:40] 21/05/2015 238627145178 238627145178 616741345153 616741345153
1 Spare tyre flat Spare tyre flat 15 June 2011 [10:41] 15/06/2011 577476561167 577476561167
1 Slight play nearside inner rack joint Slight play nearside inner rack joint 15 June 2011 [10:41] 15/06/2011 577476561167 577476561167
1 Surface corrosion front crossmember Surface corrosion front crossmember 15 June 2011 [10:41] 15/06/2011 577476561167 577476561167
1 Offside rear tyre worn to 2mm Offside rear tyre worn to 2mm 15 June 2011 [10:41] 15/06/2011 577476561167 577476561167

MOT TEST: 23 May 2018 16:04:05 PASSED
MOT TEST: 23 May 2018 16:04:05 PASSED

This test (131691667590) was completed on the 23 May 2018 16:04:05 and PASSED the requirements for a valid MOT with 1 comments.

This test (131691667590) was completed on the 23 May 2018 16:04:05 and PASSED the requirements for a valid MOT with 1 comments.

Recorded mileage: 32,206

Recorded mileage: 32,206


ADVISORY


MOT TEST: 23 May 2018 09:01:50 FAILED
MOT TEST: 23 May 2018 09:01:50 FAILED

This test (913621728911) was completed on the 23 May 2018 09:01:50 and FAILED the requirements for a valid MOT with 3 comments.

This test (913621728911) was completed on the 23 May 2018 09:01:50 and FAILED the requirements for a valid MOT with 3 comments.

Recorded mileage: 32,206

Recorded mileage: 32,206


ADVISORY

FAIL


MOT TEST: 03 May 2017 08:31:27 PASSED
MOT TEST: 03 May 2017 08:31:27 PASSED

This test (219702731194) was completed on the 03 May 2017 08:31:27 and PASSED the requirements for a valid MOT with 0 comments.

This test (219702731194) was completed on the 03 May 2017 08:31:27 and PASSED the requirements for a valid MOT with 0 comments.

Recorded mileage: 30,765

Recorded mileage: 30,765


MOT TEST: 18 May 2016 13:37:24 PASSED
MOT TEST: 18 May 2016 13:37:24 PASSED

This test (266424220013) was completed on the 18 May 2016 13:37:24 and PASSED the requirements for a valid MOT with 1 comments.

This test (266424220013) was completed on the 18 May 2016 13:37:24 and PASSED the requirements for a valid MOT with 1 comments.

Recorded mileage: 29,026

Recorded mileage: 29,026


ADVISORY


MOT TEST: 13 May 2016 11:38:23 FAILED
MOT TEST: 13 May 2016 11:38:23 FAILED

This test (897548004841) was completed on the 13 May 2016 11:38:23 and FAILED the requirements for a valid MOT with 5 comments.

This test (897548004841) was completed on the 13 May 2016 11:38:23 and FAILED the requirements for a valid MOT with 5 comments.

Recorded mileage: 29,026

Recorded mileage: 29,026


ADVISORY

FAIL


MOT TEST: 27 May 2015 14:29:14 PASSED
MOT TEST: 27 May 2015 14:29:14 PASSED

This test (238627145178) was completed on the 27 May 2015 14:29:14 and PASSED the requirements for a valid MOT with 2 comments.

This test (238627145178) was completed on the 27 May 2015 14:29:14 and PASSED the requirements for a valid MOT with 2 comments.

Recorded mileage: 27,259

Recorded mileage: 27,259


ADVISORY

USER ENTERED


MOT TEST: 21 May 2015 13:40:10 FAILED
MOT TEST: 21 May 2015 13:40:10 FAILED

This test (616741345153) was completed on the 21 May 2015 13:40:10 and FAILED the requirements for a valid MOT with 4 comments.

This test (616741345153) was completed on the 21 May 2015 13:40:10 and FAILED the requirements for a valid MOT with 4 comments.

Recorded mileage: 27,249

Recorded mileage: 27,249


ADVISORY

FAIL

USER ENTERED


MOT TEST: 03 June 2014 10:53:08 PASSED
MOT TEST: 03 June 2014 10:53:08 PASSED

This test (767884954123) was completed on the 03 June 2014 10:53:08 and PASSED the requirements for a valid MOT with 0 comments.

This test (767884954123) was completed on the 03 June 2014 10:53:08 and PASSED the requirements for a valid MOT with 0 comments.

Recorded mileage: 26,150

Recorded mileage: 26,150


MOT TEST: 15 June 2011 10:41:21 PASSED
MOT TEST: 15 June 2011 10:41:21 PASSED

This test (577476561167) was completed on the 15 June 2011 10:41:21 and PASSED the requirements for a valid MOT with 4 comments.

This test (577476561167) was completed on the 15 June 2011 10:41:21 and PASSED the requirements for a valid MOT with 4 comments.

Recorded mileage: 25,069

Recorded mileage: 25,069


USER ENTERED


MOT TEST: 13 May 2010 10:51:42 PASSED
MOT TEST: 13 May 2010 10:51:42 PASSED

This test (752793430112) was completed on the 13 May 2010 10:51:42 and PASSED the requirements for a valid MOT with 0 comments.

This test (752793430112) was completed on the 13 May 2010 10:51:42 and PASSED the requirements for a valid MOT with 0 comments.

Recorded mileage: 24,964

Recorded mileage: 24,964


MOT TEST: 11 June 2009 11:06:37 PASSED
MOT TEST: 11 June 2009 11:06:37 PASSED

This test (273632669152) was completed on the 11 June 2009 11:06:37 and PASSED the requirements for a valid MOT with 0 comments.

This test (273632669152) was completed on the 11 June 2009 11:06:37 and PASSED the requirements for a valid MOT with 0 comments.

Recorded mileage: 24,855

Recorded mileage: 24,855


MOT TEST: 19 May 2008 16:51:58 PASSED
MOT TEST: 19 May 2008 16:51:58 PASSED

This test (863740848101) was completed on the 19 May 2008 16:51:58 and PASSED the requirements for a valid MOT with 0 comments.

This test (863740848101) was completed on the 19 May 2008 16:51:58 and PASSED the requirements for a valid MOT with 0 comments.

Recorded mileage: 24,814

Recorded mileage: 24,814


MOT TEST: 18 April 2007 17:47:54 PASSED
MOT TEST: 18 April 2007 17:47:54 PASSED

This test (602898407136) was completed on the 18 April 2007 17:47:54 and PASSED the requirements for a valid MOT with 0 comments.

This test (602898407136) was completed on the 18 April 2007 17:47:54 and PASSED the requirements for a valid MOT with 0 comments.

Recorded mileage: 24,796

Recorded mileage: 24,796


MOT TEST: 18 April 2007 12:03:21 FAILED
MOT TEST: 18 April 2007 12:03:21 FAILED

This test (190948307157) was completed on the 18 April 2007 12:03:21 and FAILED the requirements for a valid MOT with 1 comments.

This test (190948307157) was completed on the 18 April 2007 12:03:21 and FAILED the requirements for a valid MOT with 1 comments.

Recorded mileage: 24,796

Recorded mileage: 24,796


FAIL


MOT TEST: 09 May 2006 11:09:06 PASSED
MOT TEST: 09 May 2006 11:09:06 PASSED

This test (843139026121) was completed on the 09 May 2006 11:09:06 and PASSED the requirements for a valid MOT with 0 comments.

This test (843139026121) was completed on the 09 May 2006 11:09:06 and PASSED the requirements for a valid MOT with 0 comments.

Recorded mileage: 24,662

Recorded mileage: 24,662