KDE 207F


KDE207F is registered to a Black 1967, Morris Minor 1000 with a Petrol engine. It Failed its most recent MOT Test on the 05 June 2017

27 unique faults (36 Total) reported in its MOT History (15 Tests).

5 common/recurring faults, the most frequent (2 times) is: Nearside Front slight roughness on rotation.

60% (9) MOT Pass Rate and a 40% (6) MOT Failure Rate.

98,886 recorded miles.

KDE 207F


KDE207F is registered to a Black 1967, Morris Minor 1000 with a Petrol engine. It Failed its most recent MOT Test on the 05 June 2017

27 unique faults (36 Total) reported in its MOT History (15 Tests).

5 common/recurring faults, the most frequent (2 times) is: Nearside Front slight roughness on rotation.

60% (9) MOT Pass Rate and a 40% (6) MOT Failure Rate.

98,886 recorded miles.

MOT PASS/Failure rate for KDE 207F

all MOT test results for KDE 207F represented as a percentage
MOT PASS/Failure rate for KDE 207F
all MOT test results for KDE 207F represented as a percentage

PERCENTAGE OF VEHICLE FAULTS WITH KDE 207F

ALL REPORTED FAULTS, DISPLAYED BY PERCENTAGE OF OCCURRENCE DURING ALL MOT TESTS
PERCENTAGE OF VEHICLE FAULTS WITH KDE 207F
ALL REPORTED FAULTS, DISPLAYED BY PERCENTAGE OF OCCURRENCE DURING ALL MOT TESTS
ADVISORY

FAIL

KDE 207F annual Faults by type

ALL REPORTED FAULTS, DISPLAYED over time and categorised by type
KDE 207F annual Faults by type
ALL REPORTED FAULTS, DISPLAYED over time and categorised by type

RECURRING FAULTS WITH KDE 207F

FAULTS THAT HAVE OCCURED MORE THAN ONCE DURING KDE 207F's MOT HISTORY
RECURRING FAULTS WITH KDE 207F
FAULTS THAT HAVE OCCURED MORE THAN ONCE DURING KDE 207F's MOT HISTORY
Fault Fault Test Date Test Date/Time Reference MOT Test Reference
2 Nearside front slight roughness on rotation Nearside front slight roughness on rotation 07 June 2016 [08:48] 07/06/2016 06 June 2016 [09:35] 06/06/2016 385871679143 385871679143 517003983617 517003983617
2 Offside front lower seat belt anchorage prescribed area is corroded but not considered excessive (5.2.6) Offside front lower seat belt anchorage prescribed area is corroded but not considered excessive (5.2.6) 17 August 2010 [17:02] 17/08/2010 17 August 2010 [12:00] 17/08/2010 812229520292 812229520292 763429720202 763429720202
2 Front front suspension has slight movement at a wishbone pin or bush (2.5.a.1c) Front front suspension has slight movement at a wishbone pin or bush (2.5.a.1c) 13 June 2008 [15:29] 13/06/2008 07 June 2008 [16:28] 07/06/2008 264455868475 264455868475 530919658198 530919658198
2 Nearside front body has slight corrosion (6.1.b.2) Nearside front body has slight corrosion (6.1.b.2) 13 June 2008 [15:29] 13/06/2008 07 June 2008 [16:28] 07/06/2008 264455868475 264455868475 530919658198 530919658198
2 Offside rear body has slight corrosion (6.1.b.2) Offside rear body has slight corrosion (6.1.b.2) 13 June 2008 [15:29] 13/06/2008 07 June 2008 [16:28] 07/06/2008 264455868475 264455868475 530919658198 530919658198

ALL KDE 207F ADVISORIES [16]

ALL ADVISORIES, ORDERED by OCCURRENCE DURING KDE 207F's MOT HISTORY
ALL KDE 207F ADVISORIES [16]
ALL ADVISORIES, ORDERED by OCCURRENCE DURING KDE 207F's MOT HISTORY
Advisory Faults | source www.vehiclestats.co.uk
Fault Fault Test Date Test Date/Time Reference MOT Test Reference
2 Nearside front slight roughness on rotation Nearside front slight roughness on rotation 07 June 2016 [08:48] 07/06/2016 06 June 2016 [09:35] 06/06/2016 385871679143 385871679143 517003983617 517003983617
2 Offside front lower seat belt anchorage prescribed area is corroded but not considered excessive (5.2.6) Offside front lower seat belt anchorage prescribed area is corroded but not considered excessive (5.2.6) 17 August 2010 [17:02] 17/08/2010 17 August 2010 [12:00] 17/08/2010 812229520292 812229520292 763429720202 763429720202
2 Front front suspension has slight movement at a wishbone pin or bush (2.5.a.1c) Front front suspension has slight movement at a wishbone pin or bush (2.5.a.1c) 13 June 2008 [15:29] 13/06/2008 07 June 2008 [16:28] 07/06/2008 264455868475 264455868475 530919658198 530919658198
2 Nearside front body has slight corrosion (6.1.b.2) Nearside front body has slight corrosion (6.1.b.2) 13 June 2008 [15:29] 13/06/2008 07 June 2008 [16:28] 07/06/2008 264455868475 264455868475 530919658198 530919658198
2 Offside rear body has slight corrosion (6.1.b.2) Offside rear body has slight corrosion (6.1.b.2) 13 June 2008 [15:29] 13/06/2008 07 June 2008 [16:28] 07/06/2008 264455868475 264455868475 530919658198 530919658198
1 Parking brake: parking brake efficiency only just met. It would appear that the braking system requires adjustment or repair. (3.7.b.7) Parking brake: parking brake efficiency only just met. It would appear that the braking system requires adjustment or repair. (3.7.b.7) 17 August 2010 [12:00] 17/08/2010 763429720202 763429720202
1 Brakes imbalanced requirements only just met. It would appear that the braking system requires adjustment or repair. (3.7.b.5b) Brakes imbalanced requirements only just met. It would appear that the braking system requires adjustment or repair. (3.7.b.5b) 17 August 2010 [12:00] 17/08/2010 763429720202 763429720202

ALL KDE 207F Failure Faults [20]

ALL Failure faults, ORDERED by OCCURRENCE DURING KDE 207F's MOT HISTORY
ALL KDE 207F Failure Faults [20]
ALL Failure faults, ORDERED by OCCURRENCE DURING KDE 207F's MOT HISTORY
Fail Faults | source www.vehiclestats.co.uk
Fault Fault Test Date Test Date/Time Reference MOT Test Reference
1 Offside rear stop lamp not working (1.2.1b) Offside rear stop lamp not working (1.2.1b) 06 June 2016 [09:35] 06/06/2016 517003983617 517003983617
1 Offside front track rod end ball joint has excessive play (2.2.b.1f) Offside front track rod end ball joint has excessive play (2.2.b.1f) 06 June 2016 [09:35] 06/06/2016 517003983617 517003983617
1 Offside track rod end ball joint has excessive play (2.2.b.1f) Offside track rod end ball joint has excessive play (2.2.b.1f) 22 January 2015 [08:43] 22/01/2015 757882725029 757882725029
1 Fuel cap/sealing device sealing washer missing (7.2.4c) Fuel cap/sealing device sealing washer missing (7.2.4c) 22 January 2015 [08:43] 22/01/2015 757882725029 757882725029
1 Offside front tyre has ply or cords exposed (4.1.d.1b) Offside front tyre has ply or cords exposed (4.1.d.1b) 17 August 2010 [12:00] 17/08/2010 763429720202 763429720202
1 Offside rear suspension component mounting prescribed area is excessively corroded (2.4.a.3) Offside rear suspension component mounting prescribed area is excessively corroded (2.4.a.3) 14 August 2009 [14:24] 14/08/2009 830016629247 830016629247
1 Nearside front vehicle structure has excessive corrosion, seriously affecting its strength within 30cm of the body mountings (6.1.b.2) Nearside front vehicle structure has excessive corrosion, seriously affecting its strength within 30cm of the body mountings (6.1.b.2) 14 August 2009 [14:24] 14/08/2009 830016629247 830016629247
1 Offside front vehicle structure has excessive corrosion, seriously affecting its strength within 30cm of the body mountings (6.1.b.2) Offside front vehicle structure has excessive corrosion, seriously affecting its strength within 30cm of the body mountings (6.1.b.2) 14 August 2009 [14:24] 14/08/2009 830016629247 830016629247
1 Steering column movement between the shaft and steering wheel (2.1.2b) Steering column movement between the shaft and steering wheel (2.1.2b) 07 June 2008 [16:28] 07/06/2008 530919658198 530919658198
1 Front tie bar/rod rubber bush deteriorated resulting in excessive movement (2.4.g.2) Front tie bar/rod rubber bush deteriorated resulting in excessive movement (2.4.g.2) 07 June 2008 [16:28] 07/06/2008 530919658198 530919658198
1 Nearside front vehicle structure has excessive corrosion which adversely affects braking or steering (6.1.a.1) Nearside front vehicle structure has excessive corrosion which adversely affects braking or steering (6.1.a.1) 07 June 2008 [16:28] 07/06/2008 530919658198 530919658198
1 Nearside rear rear wheel bearing has excessive play (2.6.2) Nearside rear rear wheel bearing has excessive play (2.6.2) 07 June 2008 [16:28] 07/06/2008 530919658198 530919658198
1 Horn not working (1.6.2a) Horn not working (1.6.2a) 21 May 2007 [15:30] 21/05/2007 304811247121 304811247121
1 Brake pedal has insufficient reserve movement (3.3.a.5) Brake pedal has insufficient reserve movement (3.3.a.5) 21 May 2007 [15:30] 21/05/2007 304811247121 304811247121
1 Nearside rear direction indicator incorrect colour (1.4.a.2f) Nearside rear direction indicator incorrect colour (1.4.a.2f) 21 May 2007 [15:30] 21/05/2007 304811247121 304811247121
1 Nearside front tyre has a cut in excess of the requirements deep enough to reach the ply or cords (4.1.d.1a) Nearside front tyre has a cut in excess of the requirements deep enough to reach the ply or cords (4.1.d.1a) 21 May 2007 [15:30] 21/05/2007 304811247121 304811247121
1 Nearside front tyre has a tear, caused by separation or partial failure of its structure (4.1.d.1b) Nearside front tyre has a tear, caused by separation or partial failure of its structure (4.1.d.1b) 21 May 2007 [15:30] 21/05/2007 304811247121 304811247121
1 Nearside front tyre tread depth below requirements of 1.6mm (4.1.e.1) Nearside front tyre tread depth below requirements of 1.6mm (4.1.e.1) 21 May 2007 [15:30] 21/05/2007 304811247121 304811247121
1 Nearside rear brake drum contaminated by oil (3.5.1h) Nearside rear brake drum contaminated by oil (3.5.1h) 21 May 2007 [15:30] 21/05/2007 304811247121 304811247121
1 Parking brake: efficiency below requirements (3.7.c.1b) Parking brake: efficiency below requirements (3.7.c.1b) 21 May 2007 [15:30] 21/05/2007 304811247121 304811247121

MOT TEST: 05 June 2017 13:40:17 PASSED
MOT TEST: 05 June 2017 13:40:17 PASSED

This test (966337789356) was completed on the 05 June 2017 13:40:17 and PASSED the requirements for a valid MOT with 0 comments.

This test (966337789356) was completed on the 05 June 2017 13:40:17 and PASSED the requirements for a valid MOT with 0 comments.

Recorded mileage: 98,886

Recorded mileage: 98,886


MOT TEST: 07 June 2016 08:48:52 PASSED
MOT TEST: 07 June 2016 08:48:52 PASSED

This test (385871679143) was completed on the 07 June 2016 08:48:52 and PASSED the requirements for a valid MOT with 1 comments.

This test (385871679143) was completed on the 07 June 2016 08:48:52 and PASSED the requirements for a valid MOT with 1 comments.

Recorded mileage: 98,857

Recorded mileage: 98,857


ADVISORY


MOT TEST: 06 June 2016 09:35:59 FAILED
MOT TEST: 06 June 2016 09:35:59 FAILED

This test (517003983617) was completed on the 06 June 2016 09:35:59 and FAILED the requirements for a valid MOT with 3 comments.

This test (517003983617) was completed on the 06 June 2016 09:35:59 and FAILED the requirements for a valid MOT with 3 comments.

Recorded mileage: 98,846

Recorded mileage: 98,846


ADVISORY

FAIL


MOT TEST: 27 January 2015 14:06:06 PASSED
MOT TEST: 27 January 2015 14:06:06 PASSED

This test (378457325031) was completed on the 27 January 2015 14:06:06 and PASSED the requirements for a valid MOT with 0 comments.

This test (378457325031) was completed on the 27 January 2015 14:06:06 and PASSED the requirements for a valid MOT with 0 comments.

Recorded mileage: 98,535

Recorded mileage: 98,535


MOT TEST: 22 January 2015 08:43:52 FAILED
MOT TEST: 22 January 2015 08:43:52 FAILED

This test (757882725029) was completed on the 22 January 2015 08:43:52 and FAILED the requirements for a valid MOT with 2 comments.

This test (757882725029) was completed on the 22 January 2015 08:43:52 and FAILED the requirements for a valid MOT with 2 comments.

Recorded mileage: 98,534

Recorded mileage: 98,534


FAIL


MOT TEST: 03 August 2011 15:17:31 PASSED
MOT TEST: 03 August 2011 15:17:31 PASSED

This test (945905811244) was completed on the 03 August 2011 15:17:31 and PASSED the requirements for a valid MOT with 0 comments.

This test (945905811244) was completed on the 03 August 2011 15:17:31 and PASSED the requirements for a valid MOT with 0 comments.

Recorded mileage: 98,519

Recorded mileage: 98,519


MOT TEST: 17 August 2010 17:02:45 PASSED
MOT TEST: 17 August 2010 17:02:45 PASSED

This test (812229520292) was completed on the 17 August 2010 17:02:45 and PASSED the requirements for a valid MOT with 1 comments.

This test (812229520292) was completed on the 17 August 2010 17:02:45 and PASSED the requirements for a valid MOT with 1 comments.

Recorded mileage: 98,017

Recorded mileage: 98,017


ADVISORY


MOT TEST: 17 August 2010 12:00:59 FAILED
MOT TEST: 17 August 2010 12:00:59 FAILED

This test (763429720202) was completed on the 17 August 2010 12:00:59 and FAILED the requirements for a valid MOT with 4 comments.

This test (763429720202) was completed on the 17 August 2010 12:00:59 and FAILED the requirements for a valid MOT with 4 comments.

Recorded mileage: 98,017

Recorded mileage: 98,017


ADVISORY

FAIL


MOT TEST: 18 August 2009 14:14:36 PASSED
MOT TEST: 18 August 2009 14:14:36 PASSED

This test (122010539247) was completed on the 18 August 2009 14:14:36 and PASSED the requirements for a valid MOT with 0 comments.

This test (122010539247) was completed on the 18 August 2009 14:14:36 and PASSED the requirements for a valid MOT with 0 comments.

Recorded mileage: 96,552

Recorded mileage: 96,552


MOT TEST: 14 August 2009 14:24:42 FAILED
MOT TEST: 14 August 2009 14:24:42 FAILED

This test (830016629247) was completed on the 14 August 2009 14:24:42 and FAILED the requirements for a valid MOT with 3 comments.

This test (830016629247) was completed on the 14 August 2009 14:24:42 and FAILED the requirements for a valid MOT with 3 comments.

Recorded mileage: 96,551

Recorded mileage: 96,551


FAIL


MOT TEST: 13 June 2008 15:29:17 PASSED
MOT TEST: 13 June 2008 15:29:17 PASSED

This test (264455868475) was completed on the 13 June 2008 15:29:17 and PASSED the requirements for a valid MOT with 5 comments.

This test (264455868475) was completed on the 13 June 2008 15:29:17 and PASSED the requirements for a valid MOT with 5 comments.

Recorded mileage: 96,162

Recorded mileage: 96,162


ADVISORY


MOT TEST: 07 June 2008 16:28:54 FAILED
MOT TEST: 07 June 2008 16:28:54 FAILED

This test (530919658198) was completed on the 07 June 2008 16:28:54 and FAILED the requirements for a valid MOT with 9 comments.

This test (530919658198) was completed on the 07 June 2008 16:28:54 and FAILED the requirements for a valid MOT with 9 comments.

Recorded mileage: 96,160

Recorded mileage: 96,160


ADVISORY

FAIL


MOT TEST: 22 May 2007 12:16:54 PASSED
MOT TEST: 22 May 2007 12:16:54 PASSED

This test (394092047194) was completed on the 22 May 2007 12:16:54 and PASSED the requirements for a valid MOT with 0 comments.

This test (394092047194) was completed on the 22 May 2007 12:16:54 and PASSED the requirements for a valid MOT with 0 comments.

Recorded mileage: 95,869

Recorded mileage: 95,869


MOT TEST: 21 May 2007 15:30:24 FAILED
MOT TEST: 21 May 2007 15:30:24 FAILED

This test (304811247121) was completed on the 21 May 2007 15:30:24 and FAILED the requirements for a valid MOT with 8 comments.

This test (304811247121) was completed on the 21 May 2007 15:30:24 and FAILED the requirements for a valid MOT with 8 comments.

Recorded mileage: 95,869

Recorded mileage: 95,869


FAIL


MOT TEST: 19 May 2006 14:46:10 PASSED
MOT TEST: 19 May 2006 14:46:10 PASSED

This test (311469236193) was completed on the 19 May 2006 14:46:10 and PASSED the requirements for a valid MOT with 0 comments.

This test (311469236193) was completed on the 19 May 2006 14:46:10 and PASSED the requirements for a valid MOT with 0 comments.

Recorded mileage: 95,122

Recorded mileage: 95,122