KDY 317H


KDY317H is registered to a Grey 1970, Morris Minor 1000 with a Petrol engine. It Failed its most recent MOT Test on the 04 May 2017

21 unique faults (23 Total) reported in its MOT History (17 Tests).

2 common/recurring faults, the most frequent (2 times) is: Exhaust has a minor leak of exhaust gases (7.1.2).

76% (13) MOT Pass Rate and a 24% (4) MOT Failure Rate.

64,083 recorded miles.

KDY 317H


KDY317H is registered to a Grey 1970, Morris Minor 1000 with a Petrol engine. It Failed its most recent MOT Test on the 04 May 2017

21 unique faults (23 Total) reported in its MOT History (17 Tests).

2 common/recurring faults, the most frequent (2 times) is: Exhaust has a minor leak of exhaust gases (7.1.2).

76% (13) MOT Pass Rate and a 24% (4) MOT Failure Rate.

64,083 recorded miles.

MOT PASS/Failure rate for KDY 317H

all MOT test results for KDY 317H represented as a percentage
MOT PASS/Failure rate for KDY 317H
all MOT test results for KDY 317H represented as a percentage

PERCENTAGE OF VEHICLE FAULTS WITH KDY 317H

ALL REPORTED FAULTS, DISPLAYED BY PERCENTAGE OF OCCURRENCE DURING ALL MOT TESTS
PERCENTAGE OF VEHICLE FAULTS WITH KDY 317H
ALL REPORTED FAULTS, DISPLAYED BY PERCENTAGE OF OCCURRENCE DURING ALL MOT TESTS
ADVISORY

FAIL

KDY 317H annual Faults by type

ALL REPORTED FAULTS, DISPLAYED over time and categorised by type
KDY 317H annual Faults by type
ALL REPORTED FAULTS, DISPLAYED over time and categorised by type

RECURRING FAULTS WITH KDY 317H

FAULTS THAT HAVE OCCURED MORE THAN ONCE DURING KDY 317H's MOT HISTORY
RECURRING FAULTS WITH KDY 317H
FAULTS THAT HAVE OCCURED MORE THAN ONCE DURING KDY 317H's MOT HISTORY
Fault Fault Test Date Test Date/Time Reference MOT Test Reference
2 Exhaust has a minor leak of exhaust gases (7.1.2) Exhaust has a minor leak of exhaust gases (7.1.2) 04 May 2017 [09:50] 04/05/2017 19 May 2015 [13:31] 19/05/2015 879928073069 879928073069 636359435185 636359435185
2 Rear exhaust has a minor leak of exhaust gases (7.1.2) Rear exhaust has a minor leak of exhaust gases (7.1.2) 16 May 2014 [15:41] 16/05/2014 12 May 2014 [11:14] 12/05/2014 127106034129 127106034129 848222134121 848222134121

ALL KDY 317H ADVISORIES [9]

ALL ADVISORIES, ORDERED by OCCURRENCE DURING KDY 317H's MOT HISTORY
ALL KDY 317H ADVISORIES [9]
ALL ADVISORIES, ORDERED by OCCURRENCE DURING KDY 317H's MOT HISTORY
Advisory Faults | source www.vehiclestats.co.uk
Fault Fault Test Date Test Date/Time Reference MOT Test Reference
2 Exhaust has a minor leak of exhaust gases (7.1.2) Exhaust has a minor leak of exhaust gases (7.1.2) 04 May 2017 [09:50] 04/05/2017 19 May 2015 [13:31] 19/05/2015 879928073069 879928073069 636359435185 636359435185
2 Rear exhaust has a minor leak of exhaust gases (7.1.2) Rear exhaust has a minor leak of exhaust gases (7.1.2) 16 May 2014 [15:41] 16/05/2014 12 May 2014 [11:14] 12/05/2014 127106034129 127106034129 848222134121 848222134121
1 Suspension component mounting prescribed area is corroded but not considered excessive o/s centre cross member (2.4.a.3) Suspension component mounting prescribed area is corroded but not considered excessive o/s centre cross member (2.4.a.3) 04 May 2017 [09:50] 04/05/2017 879928073069 879928073069
1 Front brakes imbalanced requirements only just met. It would appear that the braking system requires adjustment or repair. (3.7.b.5b) Front brakes imbalanced requirements only just met. It would appear that the braking system requires adjustment or repair. (3.7.b.5b) 11 May 2016 [11:36] 11/05/2016 483251623686 483251623686
1 Offside rear rear brake grabbing slightly (3.7.a.5b) Offside rear rear brake grabbing slightly (3.7.a.5b) 06 August 2012 [12:01] 06/08/2012 749019212218 749019212218
1 Nearside front lower suspension arm has slight play in a pin/bearing (2.4.g.2) Nearside front lower suspension arm has slight play in a pin/bearing (2.4.g.2) 06 August 2012 [12:01] 06/08/2012 749019212218 749019212218
1 Offside front lower suspension arm has slight play in a pin/bearing (2.4.g.2) Offside front lower suspension arm has slight play in a pin/bearing (2.4.g.2) 06 August 2012 [12:01] 06/08/2012 749019212218 749019212218

ALL KDY 317H Failure Faults [14]

ALL Failure faults, ORDERED by OCCURRENCE DURING KDY 317H's MOT HISTORY
ALL KDY 317H Failure Faults [14]
ALL Failure faults, ORDERED by OCCURRENCE DURING KDY 317H's MOT HISTORY
Fail Faults | source www.vehiclestats.co.uk
Fault Fault Test Date Test Date/Time Reference MOT Test Reference
1 Front brakes imbalanced across an axle (3.7.b.5b) Front brakes imbalanced across an axle (3.7.b.5b) 12 May 2014 [11:14] 12/05/2014 848222134121 848222134121
1 Nearside rear tyre tread depth below requirements of 1.6mm (4.1.e.1) Nearside rear tyre tread depth below requirements of 1.6mm (4.1.e.1) 12 May 2014 [11:14] 12/05/2014 848222134121 848222134121
1 Offside rear tyre tread depth below requirements of 1.6mm (4.1.e.1) Offside rear tyre tread depth below requirements of 1.6mm (4.1.e.1) 12 May 2014 [11:14] 12/05/2014 848222134121 848222134121
1 Brakes imbalanced across an axle (3.7.b.5b) Brakes imbalanced across an axle (3.7.b.5b) 12 May 2014 [11:14] 12/05/2014 848222134121 848222134121
1 Offside rear suspension spring mounting prescribed area is excessively corroded (2.4.a.3) Offside rear suspension spring mounting prescribed area is excessively corroded (2.4.a.3) 29 June 2010 [13:35] 29/06/2010 264780280447 264780280447
1 Nearside front front brake binding (3.7.b.1) Nearside front front brake binding (3.7.b.1) 29 June 2010 [13:35] 29/06/2010 264780280447 264780280447
1 Offside front front brake binding (3.7.b.1) Offside front front brake binding (3.7.b.1) 29 June 2010 [13:35] 29/06/2010 264780280447 264780280447
1 Nearside front brake hose excessively deteriorated (3.6.b.4d) Nearside front brake hose excessively deteriorated (3.6.b.4d) 26 June 2009 [10:16] 26/06/2009 464137179165 464137179165
1 Offside front brake hose excessively deteriorated (3.6.b.4d) Offside front brake hose excessively deteriorated (3.6.b.4d) 26 June 2009 [10:16] 26/06/2009 464137179165 464137179165
1 Nearside windscreen wiper does not clear the windscreen effectively (8.2.2) Nearside windscreen wiper does not clear the windscreen effectively (8.2.2) 26 June 2009 [10:16] 26/06/2009 464137179165 464137179165
1 Offside windscreen wiper does not clear the windscreen effectively (8.2.2) Offside windscreen wiper does not clear the windscreen effectively (8.2.2) 26 June 2009 [10:16] 26/06/2009 464137179165 464137179165
1 Rear brake application uneven (3.7.b.2) Rear brake application uneven (3.7.b.2) 26 June 2008 [10:03] 26/06/2008 862398278131 862398278131
1 Rear brakes release unevenly (3.7.b.4) Rear brakes release unevenly (3.7.b.4) 26 June 2008 [10:03] 26/06/2008 862398278131 862398278131
1 Nearside rear brake binding (3.7.b.1) Nearside rear brake binding (3.7.b.1) 26 June 2008 [10:03] 26/06/2008 862398278131 862398278131

MOT TEST: 04 May 2017 09:50:12 PASSED
MOT TEST: 04 May 2017 09:50:12 PASSED

This test (879928073069) was completed on the 04 May 2017 09:50:12 and PASSED the requirements for a valid MOT with 2 comments.

This test (879928073069) was completed on the 04 May 2017 09:50:12 and PASSED the requirements for a valid MOT with 2 comments.

Recorded mileage: 64,083

Recorded mileage: 64,083


ADVISORY


MOT TEST: 11 May 2016 11:36:30 PASSED
MOT TEST: 11 May 2016 11:36:30 PASSED

This test (483251623686) was completed on the 11 May 2016 11:36:30 and PASSED the requirements for a valid MOT with 1 comments.

This test (483251623686) was completed on the 11 May 2016 11:36:30 and PASSED the requirements for a valid MOT with 1 comments.

Recorded mileage: 63,954

Recorded mileage: 63,954


ADVISORY


MOT TEST: 19 May 2015 13:31:45 PASSED
MOT TEST: 19 May 2015 13:31:45 PASSED

This test (636359435185) was completed on the 19 May 2015 13:31:45 and PASSED the requirements for a valid MOT with 1 comments.

This test (636359435185) was completed on the 19 May 2015 13:31:45 and PASSED the requirements for a valid MOT with 1 comments.

Recorded mileage: 63,370

Recorded mileage: 63,370


ADVISORY


MOT TEST: 16 May 2014 15:41:14 PASSED
MOT TEST: 16 May 2014 15:41:14 PASSED

This test (127106034129) was completed on the 16 May 2014 15:41:14 and PASSED the requirements for a valid MOT with 1 comments.

This test (127106034129) was completed on the 16 May 2014 15:41:14 and PASSED the requirements for a valid MOT with 1 comments.

Recorded mileage: 62,716

Recorded mileage: 62,716


ADVISORY


MOT TEST: 12 May 2014 11:14:22 FAILED
MOT TEST: 12 May 2014 11:14:22 FAILED

This test (848222134121) was completed on the 12 May 2014 11:14:22 and FAILED the requirements for a valid MOT with 5 comments.

This test (848222134121) was completed on the 12 May 2014 11:14:22 and FAILED the requirements for a valid MOT with 5 comments.

Recorded mileage: 62,716

Recorded mileage: 62,716


ADVISORY

FAIL


MOT TEST: 31 May 2013 14:34:22 PASSED
MOT TEST: 31 May 2013 14:34:22 PASSED

This test (879561653165) was completed on the 31 May 2013 14:34:22 and PASSED the requirements for a valid MOT with 0 comments.

This test (879561653165) was completed on the 31 May 2013 14:34:22 and PASSED the requirements for a valid MOT with 0 comments.

Recorded mileage: 62,227

Recorded mileage: 62,227


MOT TEST: 06 August 2012 12:01:25 PASSED
MOT TEST: 06 August 2012 12:01:25 PASSED

This test (749019212218) was completed on the 06 August 2012 12:01:25 and PASSED the requirements for a valid MOT with 3 comments.

This test (749019212218) was completed on the 06 August 2012 12:01:25 and PASSED the requirements for a valid MOT with 3 comments.

Recorded mileage: 61,724

Recorded mileage: 61,724


ADVISORY


MOT TEST: 23 June 2011 12:39:47 PASSED
MOT TEST: 23 June 2011 12:39:47 PASSED

This test (959744071185) was completed on the 23 June 2011 12:39:47 and PASSED the requirements for a valid MOT with 0 comments.

This test (959744071185) was completed on the 23 June 2011 12:39:47 and PASSED the requirements for a valid MOT with 0 comments.

Recorded mileage: 61,489

Recorded mileage: 61,489


MOT TEST: 01 July 2010 16:00:19 PASSED
MOT TEST: 01 July 2010 16:00:19 PASSED

This test (924162980117) was completed on the 01 July 2010 16:00:19 and PASSED the requirements for a valid MOT with 0 comments.

This test (924162980117) was completed on the 01 July 2010 16:00:19 and PASSED the requirements for a valid MOT with 0 comments.

Recorded mileage: 60,928

Recorded mileage: 60,928


MOT TEST: 29 June 2010 13:35:21 FAILED
MOT TEST: 29 June 2010 13:35:21 FAILED

This test (264780280447) was completed on the 29 June 2010 13:35:21 and FAILED the requirements for a valid MOT with 3 comments.

This test (264780280447) was completed on the 29 June 2010 13:35:21 and FAILED the requirements for a valid MOT with 3 comments.

Recorded mileage: 60,928

Recorded mileage: 60,928


FAIL


MOT TEST: 01 July 2009 09:54:02 PASSED
MOT TEST: 01 July 2009 09:54:02 PASSED

This test (381082489142) was completed on the 01 July 2009 09:54:02 and PASSED the requirements for a valid MOT with 0 comments.

This test (381082489142) was completed on the 01 July 2009 09:54:02 and PASSED the requirements for a valid MOT with 0 comments.

Recorded mileage: 60,818

Recorded mileage: 60,818


MOT TEST: 26 June 2009 10:16:16 FAILED
MOT TEST: 26 June 2009 10:16:16 FAILED

This test (464137179165) was completed on the 26 June 2009 10:16:16 and FAILED the requirements for a valid MOT with 4 comments.

This test (464137179165) was completed on the 26 June 2009 10:16:16 and FAILED the requirements for a valid MOT with 4 comments.

Recorded mileage: 60,816

Recorded mileage: 60,816


FAIL


MOT TEST: 27 June 2008 11:02:51 PASSED
MOT TEST: 27 June 2008 11:02:51 PASSED

This test (460189978192) was completed on the 27 June 2008 11:02:51 and PASSED the requirements for a valid MOT with 0 comments.

This test (460189978192) was completed on the 27 June 2008 11:02:51 and PASSED the requirements for a valid MOT with 0 comments.

Recorded mileage: 60,611

Recorded mileage: 60,611


MOT TEST: 26 June 2008 10:03:22 FAILED
MOT TEST: 26 June 2008 10:03:22 FAILED

This test (862398278131) was completed on the 26 June 2008 10:03:22 and FAILED the requirements for a valid MOT with 3 comments.

This test (862398278131) was completed on the 26 June 2008 10:03:22 and FAILED the requirements for a valid MOT with 3 comments.

Recorded mileage: 60,611

Recorded mileage: 60,611


FAIL


MOT TEST: 27 June 2007 10:49:45 PASSED
MOT TEST: 27 June 2007 10:49:45 PASSED

This test (512348677111) was completed on the 27 June 2007 10:49:45 and PASSED the requirements for a valid MOT with 0 comments.

This test (512348677111) was completed on the 27 June 2007 10:49:45 and PASSED the requirements for a valid MOT with 0 comments.

Recorded mileage: 60,368

Recorded mileage: 60,368


MOT TEST: 27 June 2006 09:18:54 PASSED
MOT TEST: 27 June 2006 09:18:54 PASSED

This test (252888876138) was completed on the 27 June 2006 09:18:54 and PASSED the requirements for a valid MOT with 0 comments.

This test (252888876138) was completed on the 27 June 2006 09:18:54 and PASSED the requirements for a valid MOT with 0 comments.

Recorded mileage: 60,050

Recorded mileage: 60,050


MOT TEST: 24 June 2005 10:45:26 PASSED
MOT TEST: 24 June 2005 10:45:26 PASSED

This test (911445575126) was completed on the 24 June 2005 10:45:26 and PASSED the requirements for a valid MOT with 0 comments.

This test (911445575126) was completed on the 24 June 2005 10:45:26 and PASSED the requirements for a valid MOT with 0 comments.

Recorded mileage: 59,693

Recorded mileage: 59,693