KGJ 660A


KGJ660A is registered to a Green 1963, Morris Minor traveller with a Petrol engine. It Failed its most recent MOT Test on the 22 September 2017

17 unique faults (26 Total) reported in its MOT History (16 Tests).

5 common/recurring faults, the most frequent (4 times) is: Nearside Rear Leaf spring has a slightly deteriorated shackle pin rubber bush not resulting in excessive movement (2.4.B.2).

69% (11) MOT Pass Rate and a 31% (5) MOT Failure Rate.

85,994 recorded miles.

KGJ 660A


KGJ660A is registered to a Green 1963, Morris Minor traveller with a Petrol engine. It Failed its most recent MOT Test on the 22 September 2017

17 unique faults (26 Total) reported in its MOT History (16 Tests).

5 common/recurring faults, the most frequent (4 times) is: Nearside Rear Leaf spring has a slightly deteriorated shackle pin rubber bush not resulting in excessive movement (2.4.B.2).

69% (11) MOT Pass Rate and a 31% (5) MOT Failure Rate.

85,994 recorded miles.

MOT PASS/Failure rate for KGJ 660A

all MOT test results for KGJ 660A represented as a percentage
MOT PASS/Failure rate for KGJ 660A
all MOT test results for KGJ 660A represented as a percentage

PERCENTAGE OF VEHICLE FAULTS WITH KGJ 660A

ALL REPORTED FAULTS, DISPLAYED BY PERCENTAGE OF OCCURRENCE DURING ALL MOT TESTS
PERCENTAGE OF VEHICLE FAULTS WITH KGJ 660A
ALL REPORTED FAULTS, DISPLAYED BY PERCENTAGE OF OCCURRENCE DURING ALL MOT TESTS
ADVISORY

FAIL

USER ENTERED

PASS WITH RECTIFICATION

KGJ 660A annual Faults by type

ALL REPORTED FAULTS, DISPLAYED over time and categorised by type
KGJ 660A annual Faults by type
ALL REPORTED FAULTS, DISPLAYED over time and categorised by type

RECURRING FAULTS WITH KGJ 660A

FAULTS THAT HAVE OCCURED MORE THAN ONCE DURING KGJ 660A's MOT HISTORY
RECURRING FAULTS WITH KGJ 660A
FAULTS THAT HAVE OCCURED MORE THAN ONCE DURING KGJ 660A's MOT HISTORY
Fault Fault Test Date Test Date/Time Reference MOT Test Reference
4 Nearside rear leaf spring has a slightly deteriorated shackle pin rubber bush not resulting in excessive movement (2.4.b.2) Nearside rear leaf spring has a slightly deteriorated shackle pin rubber bush not resulting in excessive movement (2.4.b.2) 22 May 2014 [16:30] 22/05/2014 15 May 2014 [11:34] 15/05/2014 15 May 2012 [09:00] 15/05/2012 15 May 2012 [09:00] 15/05/2012 316182144103 316182144103 737005434195 737005434195 316136032184 316136032184 395126132107 395126132107
4 Offside rear leaf spring has a slightly deteriorated shackle pin rubber bush not resulting in excessive movement (2.4.b.2) Offside rear leaf spring has a slightly deteriorated shackle pin rubber bush not resulting in excessive movement (2.4.b.2) 22 May 2014 [16:30] 22/05/2014 15 May 2014 [11:34] 15/05/2014 15 May 2012 [09:00] 15/05/2012 15 May 2012 [09:00] 15/05/2012 316182144103 316182144103 737005434195 737005434195 316136032184 316136032184 395126132107 395126132107
2 Oil leak Oil leak 22 May 2014 [16:30] 22/05/2014 15 May 2014 [11:34] 15/05/2014 316182144103 316182144103 737005434195 737005434195
2 Rear axle leaking oil around nearside backplate area. Rear axle leaking oil around nearside backplate area. 22 May 2014 [16:30] 22/05/2014 15 May 2014 [11:34] 15/05/2014 316182144103 316182144103 737005434195 737005434195
2 Some gear oil at base of nsr backplate. Some gear oil at base of nsr backplate. 30 April 2013 [13:20] 30/04/2013 29 April 2013 [15:17] 29/04/2013 249690923433 249690923433 109209013131 109209013131

ALL KGJ 660A ADVISORIES [9]

ALL ADVISORIES, ORDERED by OCCURRENCE DURING KGJ 660A's MOT HISTORY
ALL KGJ 660A ADVISORIES [9]
ALL ADVISORIES, ORDERED by OCCURRENCE DURING KGJ 660A's MOT HISTORY
Advisory Faults | source www.vehiclestats.co.uk
Fault Fault Test Date Test Date/Time Reference MOT Test Reference
4 Nearside rear leaf spring has a slightly deteriorated shackle pin rubber bush not resulting in excessive movement (2.4.b.2) Nearside rear leaf spring has a slightly deteriorated shackle pin rubber bush not resulting in excessive movement (2.4.b.2) 22 May 2014 [16:30] 22/05/2014 15 May 2014 [11:34] 15/05/2014 15 May 2012 [09:00] 15/05/2012 15 May 2012 [09:00] 15/05/2012 316182144103 316182144103 737005434195 737005434195 316136032184 316136032184 395126132107 395126132107
4 Offside rear leaf spring has a slightly deteriorated shackle pin rubber bush not resulting in excessive movement (2.4.b.2) Offside rear leaf spring has a slightly deteriorated shackle pin rubber bush not resulting in excessive movement (2.4.b.2) 22 May 2014 [16:30] 22/05/2014 15 May 2014 [11:34] 15/05/2014 15 May 2012 [09:00] 15/05/2012 15 May 2012 [09:00] 15/05/2012 316182144103 316182144103 737005434195 737005434195 316136032184 316136032184 395126132107 395126132107
1 Nearside front brake grabbing slightly (3.7.a.2b) Nearside front brake grabbing slightly (3.7.a.2b) 29 April 2013 [15:17] 29/04/2013 109209013131 109209013131

ALL KGJ 660A Failure Faults [10]

ALL Failure faults, ORDERED by OCCURRENCE DURING KGJ 660A's MOT HISTORY
ALL KGJ 660A Failure Faults [10]
ALL Failure faults, ORDERED by OCCURRENCE DURING KGJ 660A's MOT HISTORY
Fail Faults | source www.vehiclestats.co.uk
Fault Fault Test Date Test Date/Time Reference MOT Test Reference
1 Nearside registration plate lamp not working (1.1.c.1d) Nearside registration plate lamp not working (1.1.c.1d) 15 May 2014 [11:34] 15/05/2014 737005434195 737005434195
1 Offside rear brake recording little or no effort (3.7.b.5a) Offside rear brake recording little or no effort (3.7.b.5a) 15 May 2014 [11:34] 15/05/2014 737005434195 737005434195
1 Offside rear parking brake recording little or no effort (3.7.b.6a) Offside rear parking brake recording little or no effort (3.7.b.6a) 15 May 2014 [11:34] 15/05/2014 737005434195 737005434195
1 Service brake: efficiency below requirements (3.7.b.7) Service brake: efficiency below requirements (3.7.b.7) 15 May 2014 [11:34] 15/05/2014 737005434195 737005434195
1 Parking brake: efficiency below requirements (3.7.b.7) Parking brake: efficiency below requirements (3.7.b.7) 15 May 2014 [11:34] 15/05/2014 737005434195 737005434195
1 Brakes imbalanced across an axle (3.7.b.5b) Brakes imbalanced across an axle (3.7.b.5b) 15 May 2014 [11:34] 15/05/2014 737005434195 737005434195
1 Offside front brake grabbing severely (3.7.a.2b) Offside front brake grabbing severely (3.7.a.2b) 29 April 2013 [15:17] 29/04/2013 109209013131 109209013131
1 Windscreen washer provides insufficient washer liquid (8.2.3) Windscreen washer provides insufficient washer liquid (8.2.3) 04 January 2008 [13:10] 04/01/2008 544604908040 544604908040
1 Nearside suspension component mounting prescribed area is excessively corroded (2.4.a.3) Nearside suspension component mounting prescribed area is excessively corroded (2.4.a.3) 10 October 2006 [13:43] 10/10/2006 604723786278 604723786278
1 Offside suspension component mounting prescribed area is excessively corroded (2.4.a.3) Offside suspension component mounting prescribed area is excessively corroded (2.4.a.3) 10 October 2006 [13:43] 10/10/2006 604723786278 604723786278

ALL KGJ 660A User Entered Faults [6]

ALL User Entered faults, ORDERED by OCCURRENCE DURING KGJ 660A's MOT HISTORY
ALL KGJ 660A User Entered Faults [6]
ALL User Entered faults, ORDERED by OCCURRENCE DURING KGJ 660A's MOT HISTORY
Advisory Faults | source www.vehiclestats.co.uk
Fault Fault Test Date Test Date/Time Reference MOT Test Reference
2 Oil leak Oil leak 22 May 2014 [16:30] 22/05/2014 15 May 2014 [11:34] 15/05/2014 316182144103 316182144103 737005434195 737005434195
2 Rear axle leaking oil around nearside backplate area. Rear axle leaking oil around nearside backplate area. 22 May 2014 [16:30] 22/05/2014 15 May 2014 [11:34] 15/05/2014 316182144103 316182144103 737005434195 737005434195
2 Some gear oil at base of nsr backplate. Some gear oil at base of nsr backplate. 30 April 2013 [13:20] 30/04/2013 29 April 2013 [15:17] 29/04/2013 249690923433 249690923433 109209013131 109209013131

ALL KGJ 660A Pass With Rectification Faults [1]

ALL Pass With Rectification faults, ORDERED by OCCURRENCE DURING KGJ 660A's MOT HISTORY
ALL KGJ 660A Pass With Rectification Faults [1]
ALL Pass With Rectification faults, ORDERED by OCCURRENCE DURING KGJ 660A's MOT HISTORY
Pass With Rectification Faults | source www.vehiclestats.co.uk
Fault Fault Test Date Test Date/Time Reference MOT Test Reference
1 Offside registration plate lamp not working (1.1.c.1d) Offside registration plate lamp not working (1.1.c.1d) 15 May 2012 [09:00] 15/05/2012 395126132107 395126132107

MOT TEST: 22 September 2017 10:56:39 PASSED
MOT TEST: 22 September 2017 10:56:39 PASSED

This test (424241092448) was completed on the 22 September 2017 10:56:39 and PASSED the requirements for a valid MOT with 0 comments.

This test (424241092448) was completed on the 22 September 2017 10:56:39 and PASSED the requirements for a valid MOT with 0 comments.

Recorded mileage: 85,994

Recorded mileage: 85,994


MOT TEST: 21 September 2016 15:45:46 PASSED
MOT TEST: 21 September 2016 15:45:46 PASSED

This test (686162932036) was completed on the 21 September 2016 15:45:46 and PASSED the requirements for a valid MOT with 0 comments.

This test (686162932036) was completed on the 21 September 2016 15:45:46 and PASSED the requirements for a valid MOT with 0 comments.

Recorded mileage: 85,852

Recorded mileage: 85,852


MOT TEST: 22 May 2015 15:35:59 PASSED
MOT TEST: 22 May 2015 15:35:59 PASSED

This test (768792745119) was completed on the 22 May 2015 15:35:59 and PASSED the requirements for a valid MOT with 0 comments.

This test (768792745119) was completed on the 22 May 2015 15:35:59 and PASSED the requirements for a valid MOT with 0 comments.

Recorded mileage: 85,535

Recorded mileage: 85,535


MOT TEST: 22 May 2014 16:30:27 PASSED
MOT TEST: 22 May 2014 16:30:27 PASSED

This test (316182144103) was completed on the 22 May 2014 16:30:27 and PASSED the requirements for a valid MOT with 4 comments.

This test (316182144103) was completed on the 22 May 2014 16:30:27 and PASSED the requirements for a valid MOT with 4 comments.

Recorded mileage: 85,167

Recorded mileage: 85,167


ADVISORY

USER ENTERED


MOT TEST: 15 May 2014 11:34:29 FAILED
MOT TEST: 15 May 2014 11:34:29 FAILED

This test (737005434195) was completed on the 15 May 2014 11:34:29 and FAILED the requirements for a valid MOT with 10 comments.

This test (737005434195) was completed on the 15 May 2014 11:34:29 and FAILED the requirements for a valid MOT with 10 comments.

Recorded mileage: 85,164

Recorded mileage: 85,164


ADVISORY

FAIL

USER ENTERED


MOT TEST: 30 April 2013 13:20:03 PASSED
MOT TEST: 30 April 2013 13:20:03 PASSED

This test (249690923433) was completed on the 30 April 2013 13:20:03 and PASSED the requirements for a valid MOT with 1 comments.

This test (249690923433) was completed on the 30 April 2013 13:20:03 and PASSED the requirements for a valid MOT with 1 comments.

Recorded mileage: 84,032

Recorded mileage: 84,032


USER ENTERED


MOT TEST: 29 April 2013 15:17:03 FAILED
MOT TEST: 29 April 2013 15:17:03 FAILED

This test (109209013131) was completed on the 29 April 2013 15:17:03 and FAILED the requirements for a valid MOT with 3 comments.

This test (109209013131) was completed on the 29 April 2013 15:17:03 and FAILED the requirements for a valid MOT with 3 comments.

Recorded mileage: 84,030

Recorded mileage: 84,030


ADVISORY

FAIL

USER ENTERED


MOT TEST: 15 May 2012 09:00:00 PASSED
MOT TEST: 15 May 2012 09:00:00 PASSED

This test (316136032184) was completed on the 15 May 2012 09:00:00 and PASSED the requirements for a valid MOT with 2 comments.

This test (316136032184) was completed on the 15 May 2012 09:00:00 and PASSED the requirements for a valid MOT with 2 comments.

Recorded mileage: 83,821

Recorded mileage: 83,821


ADVISORY


MOT TEST: 15 May 2012 09:00:00 FAILED
MOT TEST: 15 May 2012 09:00:00 FAILED

This test (395126132107) was completed on the 15 May 2012 09:00:00 and FAILED the requirements for a valid MOT with 3 comments.

This test (395126132107) was completed on the 15 May 2012 09:00:00 and FAILED the requirements for a valid MOT with 3 comments.

Recorded mileage: 83,821

Recorded mileage: 83,821


ADVISORY

PASS WITH RECTIFICATION


MOT TEST: 09 May 2011 09:23:31 PASSED
MOT TEST: 09 May 2011 09:23:31 PASSED

This test (217039021148) was completed on the 09 May 2011 09:23:31 and PASSED the requirements for a valid MOT with 0 comments.

This test (217039021148) was completed on the 09 May 2011 09:23:31 and PASSED the requirements for a valid MOT with 0 comments.

Recorded mileage: 83,681

Recorded mileage: 83,681


MOT TEST: 01 October 2009 16:01:11 PASSED
MOT TEST: 01 October 2009 16:01:11 PASSED

This test (514224479224) was completed on the 01 October 2009 16:01:11 and PASSED the requirements for a valid MOT with 0 comments.

This test (514224479224) was completed on the 01 October 2009 16:01:11 and PASSED the requirements for a valid MOT with 0 comments.

Recorded mileage: 83,550

Recorded mileage: 83,550


MOT TEST: 04 January 2008 14:13:24 PASSED
MOT TEST: 04 January 2008 14:13:24 PASSED

This test (902934008009) was completed on the 04 January 2008 14:13:24 and PASSED the requirements for a valid MOT with 0 comments.

This test (902934008009) was completed on the 04 January 2008 14:13:24 and PASSED the requirements for a valid MOT with 0 comments.

Recorded mileage: 83,411

Recorded mileage: 83,411


MOT TEST: 04 January 2008 13:10:44 FAILED
MOT TEST: 04 January 2008 13:10:44 FAILED

This test (544604908040) was completed on the 04 January 2008 13:10:44 and FAILED the requirements for a valid MOT with 1 comments.

This test (544604908040) was completed on the 04 January 2008 13:10:44 and FAILED the requirements for a valid MOT with 1 comments.

Recorded mileage: 83,411

Recorded mileage: 83,411


FAIL


MOT TEST: 23 November 2006 18:11:52 PASSED
MOT TEST: 23 November 2006 18:11:52 PASSED

This test (494107326352) was completed on the 23 November 2006 18:11:52 and PASSED the requirements for a valid MOT with 0 comments.

This test (494107326352) was completed on the 23 November 2006 18:11:52 and PASSED the requirements for a valid MOT with 0 comments.

Recorded mileage: 83,344

Recorded mileage: 83,344


MOT TEST: 10 October 2006 13:43:01 FAILED
MOT TEST: 10 October 2006 13:43:01 FAILED

This test (604723786278) was completed on the 10 October 2006 13:43:01 and FAILED the requirements for a valid MOT with 2 comments.

This test (604723786278) was completed on the 10 October 2006 13:43:01 and FAILED the requirements for a valid MOT with 2 comments.

Recorded mileage: 83,315

Recorded mileage: 83,315


FAIL


MOT TEST: 20 October 2005 19:31:00 PASSED
MOT TEST: 20 October 2005 19:31:00 PASSED

This test (362173095473) was completed on the 20 October 2005 19:31:00 and PASSED the requirements for a valid MOT with 0 comments.

This test (362173095473) was completed on the 20 October 2005 19:31:00 and PASSED the requirements for a valid MOT with 0 comments.

Recorded mileage: 83,220

Recorded mileage: 83,220